{"text_format":"1","workbook":"xlsx","n_sheets":3,"sheets":["Abteilung Urlaubsplaner","Einstellungen","BUSY ANT"],"not_rendered":{"charts":0,"images":2,"macros":1,"external_links":1,"defined_names":5,"comments":1,"pivot_tables":0},"unopened":[],"bounds":{"document_bytes":16777216,"sheet_cells":100000,"rows_first":2000,"rows_last":500,"rows_between":2000,"halvings":0,"cell_chars":16384,"cell_head_chars":4096},"cells_cut":0,"cells_raw":0,"read":"whole","date_system":"1900"}

{"sheet":"Abteilung Urlaubsplaner","index":0,"n_rows":741,"n_cols":22,"rows_kept":741,"cut":false,"hidden":false,"merged":[[1,7,1,8]]}
[{"$f":"\"Abteilung Urlaubsplaner \"&Einstellungen!B1","v":"Abteilung Urlaubsplaner 2019"}]
[null,null,null,null,null,null,null,"Führung",null,"Temporär","Customer Service & Support",null,null,null,"Aussendienst",null,null,null,null,null,"Marketing"]
[null,null,null,null,null,"Firmen Ereignisse","Abteilungs Ereignisse","Abteilungs Leiter","Sekretariat","Auditor","Leiter CS&S","CS&S 1","CS&S 2","CS&S 3","Leiter Aussendienst","Aussendienst 1","Aussendienst 2","Aussendienst 3","Aussendienst 4","Aussendienst 5","Leiter Marketing","Produkt Manager 1"]
[{"$f":"IF(DAY(D4)=1,D4,\"\")","v":"2019-01-01"},{"$f":"WEEKNUM(C4)","v":1},{"$f":"D4","v":"2019-01-01"},{"$f":"DATE(Einstellungen!B1,1,1)","v":"2019-01-01"},{"$f":"IFERROR(IF(VLOOKUP(D4,tblFeiertage[Datum],1,0)=D4,\"x\"),\"\")","v":""},null,null,null,null,null,"Urlaub - Genehmigt"]
["",null,{"$f":"IFERROR(VLOOKUP($D4,tblFeiertage[],2,0),\"\")","v":""},null,{"$f":"IFERROR(IF(VLOOKUP(D5,tblFeiertage[Datum],1,0)=D5,\"x\"),\"\")","v":""},null,null,null,null,null,"Urlaub - Genehmigt"]
["",null,{"$f":"D6","v":"2019-01-02"},{"$f":"D4+1","v":"2019-01-02"},{"$f":"IFERROR(IF(VLOOKUP(D6,tblFeiertage[Datum],1,0)=D6,\"x\"),\"\")","v":""},null,null,null,null,null,"Urlaub - Genehmigt"]
["",null,{"$f":"IFERROR(VLOOKUP($D6,tblFeiertage[],2,0),\"\")","v":""},null,{"$f":"IFERROR(IF(VLOOKUP(D7,tblFeiertage[Datum],1,0)=D7,\"x\"),\"\")","v":""},null,null,null,null,null,"Urlaub - Genehmigt"]
["",null,{"$f":"D8","v":"2019-01-03"},{"$f":"D6+1","v":"2019-01-03"},{"$f":"IFERROR(IF(VLOOKUP(D8,tblFeiertage[Datum],1,0)=D8,\"x\"),\"\")","v":""},null,null,null,"Urlaub - Beantragt","Urlaub - Genehmigt","Urlaub - Genehmigt","Komp. von Überstunden","Komp. von Überstunden"]
["",null,{"$f":"IFERROR(VLOOKUP($D8,tblFeiertage[],2,0),\"\")","v":""},null,{"$f":"IFERROR(IF(VLOOKUP(D9,tblFeiertage[Datum],1,0)=D9,\"x\"),\"\")","v":""},null,null,null,"Urlaub - Beantragt","Urlaub - Genehmigt","Urlaub - Genehmigt","Komp. von Überstunden","Komp. von Überstunden"]
["",null,{"$f":"D10","v":"2019-01-04"},{"$f":"D8+1","v":"2019-01-04"},{"$f":"IFERROR(IF(VLOOKUP(D10,tblFeiertage[Datum],1,0)=D10,\"x\"),\"\")","v":""},null,null,null,null,null,"Urlaub - Genehmigt"]
["",null,{"$f":"IFERROR(VLOOKUP($D10,tblFeiertage[],2,0),\"\")","v":""},null,{"$f":"IFERROR(IF(VLOOKUP(D11,tblFeiertage[Datum],1,0)=D11,\"x\"),\"\")","v":""},null,null,null,null,null,"Urlaub - Genehmigt"]
["",null,{"$f":"D12","v":"2019-01-05"},{"$f":"D10+1","v":"2019-01-05"},{"$f":"IFERROR(IF(VLOOKUP(D12,tblFeiertage[Datum],1,0)=D12,\"x\"),\"\")","v":""}]
["",null,{"$f":"IFERROR(VLOOKUP($D12,tblFeiertage[],2,0),\"\")","v":""},null,{"$f":"IFERROR(IF(VLOOKUP(D13,tblFeiertage[Datum],1,0)=D13,\"x\"),\"\")","v":""}]
["",null,{"$f":"D14","v":"2019-01-06"},{"$f":"D12+1","v":"2019-01-06"},{"$f":"IFERROR(IF(VLOOKUP(D14,tblFeiertage[Datum],1,0)=D14,\"x\"),\"\")","v":""}]
["",null,{"$f":"IFERROR(VLOOKUP($D14,tblFeiertage[],2,0),\"\")","v":""},null,{"$f":"IFERROR(IF(VLOOKUP(D15,tblFeiertage[Datum],1,0)=D15,\"x\"),\"\")","v":""}]
["",{"$f":"WEEKNUM(C16)","v":2},{"$f":"D16","v":"2019-01-07"},{"$f":"D14+1","v":"2019-01-07"},{"$f":"IFERROR(IF(VLOOKUP(D16,tblFeiertage[Datum],1,0)=D16,\"x\"),\"\")","v":""},null,null,null,"Urlaub - Genehmigt"]
["",null,{"$f":"IFERROR(VLOOKUP($D16,tblFeiertage[],2,0),\"\")","v":""},null,{"$f":"IFERROR(IF(VLOOKUP(D17,tblFeiertage[Datum],1,0)=D17,\"x\"),\"\")","v":""},null,null,null,"Urlaub - Genehmigt"]
["",null,{"$f":"D18","v":"2019-01-08"},{"$f":"D16+1","v":"2019-01-08"},{"$f":"IFERROR(IF(VLOOKUP(D18,tblFeiertage[Datum],1,0)=D18,\"x\"),\"\")","v":""},null,null,null,"Urlaub - Genehmigt"]
["",null,{"$f":"IFERROR(VLOOKUP($D18,tblFeiertage[],2,0),\"\")","v":""},null,{"$f":"IFERROR(IF(VLOOKUP(D19,tblFeiertage[Datum],1,0)=D19,\"x\"),\"\")","v":""},null,null,null,"Urlaub - Genehmigt"]
["",null,{"$f":"D20","v":"2019-01-09"},{"$f":"D18+1","v":"2019-01-09"},{"$f":"IFERROR(IF(VLOOKUP(D20,tblFeiertage[Datum],1,0)=D20,\"x\"),\"\")","v":""},null,null,null,null,null,"Kurse / Weiterbildung"]
["",null,{"$f":"IFERROR(VLOOKUP($D20,tblFeiertage[],2,0),\"\")","v":""},null,{"$f":"IFERROR(IF(VLOOKUP(D21,tblFeiertage[Datum],1,0)=D21,\"x\"),\"\")","v":""},null,null,null,null,null,"Kurse / Weiterbildung"]
["",null,{"$f":"D22","v":"2019-01-10"},{"$f":"D20+1","v":"2019-01-10"},{"$f":"IFERROR(IF(VLOOKUP(D22,tblFeiertage[Datum],1,0)=D22,\"x\"),\"\")","v":""},"Etwas anderes",null,null,null,null,null,null,null,"Militär / Zivildienst"]
["",null,{"$f":"IFERROR(VLOOKUP($D22,tblFeiertage[],2,0),\"\")","v":""},null,{"$f":"IFERROR(IF(VLOOKUP(D23,tblFeiertage[Datum],1,0)=D23,\"x\"),\"\")","v":""},"Etwas anderes",null,null,null,null,null,null,null,"Militär / Zivildienst"]
["",null,{"$f":"D24","v":"2019-01-11"},{"$f":"D22+1","v":"2019-01-11"},{"$f":"IFERROR(IF(VLOOKUP(D24,tblFeiertage[Datum],1,0)=D24,\"x\"),\"\")","v":""}]
["",null,{"$f":"IFERROR(VLOOKUP($D24,tblFeiertage[],2,0),\"\")","v":""},null,{"$f":"IFERROR(IF(VLOOKUP(D25,tblFeiertage[Datum],1,0)=D25,\"x\"),\"\")","v":""}]
["",null,{"$f":"D26","v":"2019-01-12"},{"$f":"D24+1","v":"2019-01-12"},{"$f":"IFERROR(IF(VLOOKUP(D26,tblFeiertage[Datum],1,0)=D26,\"x\"),\"\")","v":""}]
["",null,{"$f":"IFERROR(VLOOKUP($D26,tblFeiertage[],2,0),\"\")","v":""},null,{"$f":"IFERROR(IF(VLOOKUP(D27,tblFeiertage[Datum],1,0)=D27,\"x\"),\"\")","v":""}]
["",null,{"$f":"D28","v":"2019-01-13"},{"$f":"D26+1","v":"2019-01-13"},{"$f":"IFERROR(IF(VLOOKUP(D28,tblFeiertage[Datum],1,0)=D28,\"x\"),\"\")","v":""}]
["",null,{"$f":"IFERROR(VLOOKUP($D28,tblFeiertage[],2,0),\"\")","v":""},null,{"$f":"IFERROR(IF(VLOOKUP(D29,tblFeiertage[Datum],1,0)=D29,\"x\"),\"\")","v":""}]
["",{"$f":"WEEKNUM(C30)","v":3},{"$f":"D30","v":"2019-01-14"},{"$f":"D28+1","v":"2019-01-14"},{"$f":"IFERROR(IF(VLOOKUP(D30,tblFeiertage[Datum],1,0)=D30,\"x\"),\"\")","v":""},null,null,"Dienst. Abwesenheit"]
["",null,{"$f":"IFERROR(VLOOKUP($D30,tblFeiertage[],2,0),\"\")","v":""},null,{"$f":"IFERROR(IF(VLOOKUP(D31,tblFeiertage[Datum],1,0)=D31,\"x\"),\"\")","v":""},null,null,"Dienst. Abwesenheit"]
["",null,{"$f":"D32","v":"2019-01-15"},{"$f":"D30+1","v":"2019-01-15"},{"$f":"IFERROR(IF(VLOOKUP(D32,tblFeiertage[Datum],1,0)=D32,\"x\"),\"\")","v":""},null,null,"Dienst. Abwesenheit"]
["",null,{"$f":"IFERROR(VLOOKUP($D32,tblFeiertage[],2,0),\"\")","v":""},null,{"$f":"IFERROR(IF(VLOOKUP(D33,tblFeiertage[Datum],1,0)=D33,\"x\"),\"\")","v":""},null,null,"Dienst. Abwesenheit"]
["",null,{"$f":"D34","v":"2019-01-16"},{"$f":"D32+1","v":"2019-01-16"},{"$f":"IFERROR(IF(VLOOKUP(D34,tblFeiertage[Datum],1,0)=D34,\"x\"),\"\")","v":""},null,null,"Dienst. Abwesenheit"]
["",null,{"$f":"IFERROR(VLOOKUP($D34,tblFeiertage[],2,0),\"\")","v":""},null,{"$f":"IFERROR(IF(VLOOKUP(D35,tblFeiertage[Datum],1,0)=D35,\"x\"),\"\")","v":""},null,null,"Dienst. Abwesenheit"]
["",null,{"$f":"D36","v":"2019-01-17"},{"$f":"D34+1","v":"2019-01-17"},{"$f":"IFERROR(IF(VLOOKUP(D36,tblFeiertage[Datum],1,0)=D36,\"x\"),\"\")","v":""},null,null,"Dienst. Abwesenheit"]
["",null,{"$f":"IFERROR(VLOOKUP($D36,tblFeiertage[],2,0),\"\")","v":""},null,{"$f":"IFERROR(IF(VLOOKUP(D37,tblFeiertage[Datum],1,0)=D37,\"x\"),\"\")","v":""},null,null,"Dienst. Abwesenheit"]
["",null,{"$f":"D38","v":"2019-01-18"},{"$f":"D36+1","v":"2019-01-18"},{"$f":"IFERROR(IF(VLOOKUP(D38,tblFeiertage[Datum],1,0)=D38,\"x\"),\"\")","v":""}]
["",null,{"$f":"IFERROR(VLOOKUP($D38,tblFeiertage[],2,0),\"\")","v":""},null,{"$f":"IFERROR(IF(VLOOKUP(D39,tblFeiertage[Datum],1,0)=D39,\"x\"),\"\")","v":""}]
["",null,{"$f":"D40","v":"2019-01-19"},{"$f":"D38+1","v":"2019-01-19"},{"$f":"IFERROR(IF(VLOOKUP(D40,tblFeiertage[Datum],1,0)=D40,\"x\"),\"\")","v":""}]
["",null,{"$f":"IFERROR(VLOOKUP($D40,tblFeiertage[],2,0),\"\")","v":""},null,{"$f":"IFERROR(IF(VLOOKUP(D41,tblFeiertage[Datum],1,0)=D41,\"x\"),\"\")","v":""}]
["",null,{"$f":"D42","v":"2019-01-20"},{"$f":"D40+1","v":"2019-01-20"},{"$f":"IFERROR(IF(VLOOKUP(D42,tblFeiertage[Datum],1,0)=D42,\"x\"),\"\")","v":""}]
["",null,{"$f":"IFERROR(VLOOKUP($D42,tblFeiertage[],2,0),\"\")","v":""},null,{"$f":"IFERROR(IF(VLOOKUP(D43,tblFeiertage[Datum],1,0)=D43,\"x\"),\"\")","v":""}]
["",{"$f":"WEEKNUM(C44)","v":4},{"$f":"D44","v":"2019-01-21"},{"$f":"D42+1","v":"2019-01-21"},{"$f":"IFERROR(IF(VLOOKUP(D44,tblFeiertage[Datum],1,0)=D44,\"x\"),\"\")","v":""}]
["",null,{"$f":"IFERROR(VLOOKUP($D44,tblFeiertage[],2,0),\"\")","v":""},null,{"$f":"IFERROR(IF(VLOOKUP(D45,tblFeiertage[Datum],1,0)=D45,\"x\"),\"\")","v":""}]
["",null,{"$f":"D46","v":"2019-01-22"},{"$f":"D44+1","v":"2019-01-22"},{"$f":"IFERROR(IF(VLOOKUP(D46,tblFeiertage[Datum],1,0)=D46,\"x\"),\"\")","v":""}]
["",null,{"$f":"IFERROR(VLOOKUP($D46,tblFeiertage[],2,0),\"\")","v":""},null,{"$f":"IFERROR(IF(VLOOKUP(D47,tblFeiertage[Datum],1,0)=D47,\"x\"),\"\")","v":""}]
["",null,{"$f":"D48","v":"2019-01-23"},{"$f":"D46+1","v":"2019-01-23"},{"$f":"IFERROR(IF(VLOOKUP(D48,tblFeiertage[Datum],1,0)=D48,\"x\"),\"\")","v":""}]
["",null,{"$f":"IFERROR(VLOOKUP($D48,tblFeiertage[],2,0),\"\")","v":""},null,{"$f":"IFERROR(IF(VLOOKUP(D49,tblFeiertage[Datum],1,0)=D49,\"x\"),\"\")","v":""}]
["",null,{"$f":"D50","v":"2019-01-24"},{"$f":"D48+1","v":"2019-01-24"},{"$f":"IFERROR(IF(VLOOKUP(D50,tblFeiertage[Datum],1,0)=D50,\"x\"),\"\")","v":""}]
["",null,{"$f":"IFERROR(VLOOKUP($D50,tblFeiertage[],2,0),\"\")","v":""},null,{"$f":"IFERROR(IF(VLOOKUP(D51,tblFeiertage[Datum],1,0)=D51,\"x\"),\"\")","v":""}]
["",null,{"$f":"D52","v":"2019-01-25"},{"$f":"D50+1","v":"2019-01-25"},{"$f":"IFERROR(IF(VLOOKUP(D52,tblFeiertage[Datum],1,0)=D52,\"x\"),\"\")","v":""}]
["",null,{"$f":"IFERROR(VLOOKUP($D52,tblFeiertage[],2,0),\"\")","v":""},null,{"$f":"IFERROR(IF(VLOOKUP(D53,tblFeiertage[Datum],1,0)=D53,\"x\"),\"\")","v":""}]
["",null,{"$f":"D54","v":"2019-01-26"},{"$f":"D52+1","v":"2019-01-26"},{"$f":"IFERROR(IF(VLOOKUP(D54,tblFeiertage[Datum],1,0)=D54,\"x\"),\"\")","v":""}]
["",null,{"$f":"IFERROR(VLOOKUP($D54,tblFeiertage[],2,0),\"\")","v":""},null,{"$f":"IFERROR(IF(VLOOKUP(D55,tblFeiertage[Datum],1,0)=D55,\"x\"),\"\")","v":""}]
["",null,{"$f":"D56","v":"2019-01-27"},{"$f":"D54+1","v":"2019-01-27"},{"$f":"IFERROR(IF(VLOOKUP(D56,tblFeiertage[Datum],1,0)=D56,\"x\"),\"\")","v":""}]
["",null,{"$f":"IFERROR(VLOOKUP($D56,tblFeiertage[],2,0),\"\")","v":""},null,{"$f":"IFERROR(IF(VLOOKUP(D57,tblFeiertage[Datum],1,0)=D57,\"x\"),\"\")","v":""}]
["",{"$f":"WEEKNUM(C58)","v":5},{"$f":"D58","v":"2019-01-28"},{"$f":"D56+1","v":"2019-01-28"},{"$f":"IFERROR(IF(VLOOKUP(D58,tblFeiertage[Datum],1,0)=D58,\"x\"),\"\")","v":""}]
["",null,{"$f":"IFERROR(VLOOKUP($D58,tblFeiertage[],2,0),\"\")","v":""},null,{"$f":"IFERROR(IF(VLOOKUP(D59,tblFeiertage[Datum],1,0)=D59,\"x\"),\"\")","v":""}]
["",null,{"$f":"D60","v":"2019-01-29"},{"$f":"D58+1","v":"2019-01-29"},{"$f":"IFERROR(IF(VLOOKUP(D60,tblFeiertage[Datum],1,0)=D60,\"x\"),\"\")","v":""}]
["",null,{"$f":"IFERROR(VLOOKUP($D60,tblFeiertage[],2,0),\"\")","v":""},null,{"$f":"IFERROR(IF(VLOOKUP(D61,tblFeiertage[Datum],1,0)=D61,\"x\"),\"\")","v":""}]
["",null,{"$f":"D62","v":"2019-01-30"},{"$f":"D60+1","v":"2019-01-30"},{"$f":"IFERROR(IF(VLOOKUP(D62,tblFeiertage[Datum],1,0)=D62,\"x\"),\"\")","v":""}]
["",null,{"$f":"IFERROR(VLOOKUP($D62,tblFeiertage[],2,0),\"\")","v":""},null,{"$f":"IFERROR(IF(VLOOKUP(D63,tblFeiertage[Datum],1,0)=D63,\"x\"),\"\")","v":""}]
["",null,{"$f":"D64","v":"2019-01-31"},{"$f":"D62+1","v":"2019-01-31"},{"$f":"IFERROR(IF(VLOOKUP(D64,tblFeiertage[Datum],1,0)=D64,\"x\"),\"\")","v":""}]
["",null,{"$f":"IFERROR(VLOOKUP($D64,tblFeiertage[],2,0),\"\")","v":""},null,{"$f":"IFERROR(IF(VLOOKUP(D65,tblFeiertage[Datum],1,0)=D65,\"x\"),\"\")","v":""}]
[{"$f":"IF(DAY(D66)=1,D66,\"\")","v":"2019-02-01"},null,{"$f":"D66","v":"2019-02-01"},{"$f":"D64+1","v":"2019-02-01"},{"$f":"IFERROR(IF(VLOOKUP(D66,tblFeiertage[Datum],1,0)=D66,\"x\"),\"\")","v":""}]
[{"$f":"IF(DAY(D67)=1,D67,\"\")","v":""},null,{"$f":"IFERROR(VLOOKUP($D66,tblFeiertage[],2,0),\"\")","v":""},null,{"$f":"IFERROR(IF(VLOOKUP(D67,tblFeiertage[Datum],1,0)=D67,\"x\"),\"\")","v":""}]
["",null,{"$f":"D68","v":"2019-02-02"},{"$f":"D66+1","v":"2019-02-02"},{"$f":"IFERROR(IF(VLOOKUP(D68,tblFeiertage[Datum],1,0)=D68,\"x\"),\"\")","v":""}]
["",null,{"$f":"IFERROR(VLOOKUP($D68,tblFeiertage[],2,0),\"\")","v":""},null,{"$f":"IFERROR(IF(VLOOKUP(D69,tblFeiertage[Datum],1,0)=D69,\"x\"),\"\")","v":""}]
["",null,{"$f":"D70","v":"2019-02-03"},{"$f":"D68+1","v":"2019-02-03"},{"$f":"IFERROR(IF(VLOOKUP(D70,tblFeiertage[Datum],1,0)=D70,\"x\"),\"\")","v":""}]
["",null,{"$f":"IFERROR(VLOOKUP($D70,tblFeiertage[],2,0),\"\")","v":""},null,{"$f":"IFERROR(IF(VLOOKUP(D71,tblFeiertage[Datum],1,0)=D71,\"x\"),\"\")","v":""}]
["",{"$f":"WEEKNUM(C72)","v":6},{"$f":"D72","v":"2019-02-04"},{"$f":"D70+1","v":"2019-02-04"},{"$f":"IFERROR(IF(VLOOKUP(D72,tblFeiertage[Datum],1,0)=D72,\"x\"),\"\")","v":""}]
["",null,{"$f":"IFERROR(VLOOKUP($D72,tblFeiertage[],2,0),\"\")","v":""},null,{"$f":"IFERROR(IF(VLOOKUP(D73,tblFeiertage[Datum],1,0)=D73,\"x\"),\"\")","v":""}]
["",null,{"$f":"D74","v":"2019-02-05"},{"$f":"D72+1","v":"2019-02-05"},{"$f":"IFERROR(IF(VLOOKUP(D74,tblFeiertage[Datum],1,0)=D74,\"x\"),\"\")","v":""}]
["",null,{"$f":"IFERROR(VLOOKUP($D74,tblFeiertage[],2,0),\"\")","v":""},null,{"$f":"IFERROR(IF(VLOOKUP(D75,tblFeiertage[Datum],1,0)=D75,\"x\"),\"\")","v":""}]
["",null,{"$f":"D76","v":"2019-02-06"},{"$f":"D74+1","v":"2019-02-06"},{"$f":"IFERROR(IF(VLOOKUP(D76,tblFeiertage[Datum],1,0)=D76,\"x\"),\"\")","v":""}]
["",null,{"$f":"IFERROR(VLOOKUP($D76,tblFeiertage[],2,0),\"\")","v":""},null,{"$f":"IFERROR(IF(VLOOKUP(D77,tblFeiertage[Datum],1,0)=D77,\"x\"),\"\")","v":""}]
["",null,{"$f":"D78","v":"2019-02-07"},{"$f":"D76+1","v":"2019-02-07"},{"$f":"IFERROR(IF(VLOOKUP(D78,tblFeiertage[Datum],1,0)=D78,\"x\"),\"\")","v":""}]
["",null,{"$f":"IFERROR(VLOOKUP($D78,tblFeiertage[],2,0),\"\")","v":""},null,{"$f":"IFERROR(IF(VLOOKUP(D79,tblFeiertage[Datum],1,0)=D79,\"x\"),\"\")","v":""}]
["",null,{"$f":"D80","v":"2019-02-08"},{"$f":"D78+1","v":"2019-02-08"},{"$f":"IFERROR(IF(VLOOKUP(D80,tblFeiertage[Datum],1,0)=D80,\"x\"),\"\")","v":""}]
["",null,{"$f":"IFERROR(VLOOKUP($D80,tblFeiertage[],2,0),\"\")","v":""},null,{"$f":"IFERROR(IF(VLOOKUP(D81,tblFeiertage[Datum],1,0)=D81,\"x\"),\"\")","v":""}]
["",null,{"$f":"D82","v":"2019-02-09"},{"$f":"D80+1","v":"2019-02-09"},{"$f":"IFERROR(IF(VLOOKUP(D82,tblFeiertage[Datum],1,0)=D82,\"x\"),\"\")","v":""}]
["",null,{"$f":"IFERROR(VLOOKUP($D82,tblFeiertage[],2,0),\"\")","v":""},null,{"$f":"IFERROR(IF(VLOOKUP(D83,tblFeiertage[Datum],1,0)=D83,\"x\"),\"\")","v":""}]
["",null,{"$f":"D84","v":"2019-02-10"},{"$f":"D82+1","v":"2019-02-10"},{"$f":"IFERROR(IF(VLOOKUP(D84,tblFeiertage[Datum],1,0)=D84,\"x\"),\"\")","v":""}]
["",null,{"$f":"IFERROR(VLOOKUP($D84,tblFeiertage[],2,0),\"\")","v":""},null,{"$f":"IFERROR(IF(VLOOKUP(D85,tblFeiertage[Datum],1,0)=D85,\"x\"),\"\")","v":""}]
["",{"$f":"WEEKNUM(C86)","v":7},{"$f":"D86","v":"2019-02-11"},{"$f":"D84+1","v":"2019-02-11"},{"$f":"IFERROR(IF(VLOOKUP(D86,tblFeiertage[Datum],1,0)=D86,\"x\"),\"\")","v":""}]
["",null,{"$f":"IFERROR(VLOOKUP($D86,tblFeiertage[],2,0),\"\")","v":""},null,{"$f":"IFERROR(IF(VLOOKUP(D87,tblFeiertage[Datum],1,0)=D87,\"x\"),\"\")","v":""}]
["",null,{"$f":"D88","v":"2019-02-12"},{"$f":"D86+1","v":"2019-02-12"},{"$f":"IFERROR(IF(VLOOKUP(D88,tblFeiertage[Datum],1,0)=D88,\"x\"),\"\")","v":""}]
["",null,{"$f":"IFERROR(VLOOKUP($D88,tblFeiertage[],2,0),\"\")","v":""},null,{"$f":"IFERROR(IF(VLOOKUP(D89,tblFeiertage[Datum],1,0)=D89,\"x\"),\"\")","v":""}]
["",null,{"$f":"D90","v":"2019-02-13"},{"$f":"D88+1","v":"2019-02-13"},{"$f":"IFERROR(IF(VLOOKUP(D90,tblFeiertage[Datum],1,0)=D90,\"x\"),\"\")","v":""}]
["",null,{"$f":"IFERROR(VLOOKUP($D90,tblFeiertage[],2,0),\"\")","v":""},null,{"$f":"IFERROR(IF(VLOOKUP(D91,tblFeiertage[Datum],1,0)=D91,\"x\"),\"\")","v":""}]
["",null,{"$f":"D92","v":"2019-02-14"},{"$f":"D90+1","v":"2019-02-14"},{"$f":"IFERROR(IF(VLOOKUP(D92,tblFeiertage[Datum],1,0)=D92,\"x\"),\"\")","v":""}]
["",null,{"$f":"IFERROR(VLOOKUP($D92,tblFeiertage[],2,0),\"\")","v":""},null,{"$f":"IFERROR(IF(VLOOKUP(D93,tblFeiertage[Datum],1,0)=D93,\"x\"),\"\")","v":""}]
["",null,{"$f":"D94","v":"2019-02-15"},{"$f":"D92+1","v":"2019-02-15"},{"$f":"IFERROR(IF(VLOOKUP(D94,tblFeiertage[Datum],1,0)=D94,\"x\"),\"\")","v":""}]
["",null,{"$f":"IFERROR(VLOOKUP($D94,tblFeiertage[],2,0),\"\")","v":""},null,{"$f":"IFERROR(IF(VLOOKUP(D95,tblFeiertage[Datum],1,0)=D95,\"x\"),\"\")","v":""}]
["",null,{"$f":"D96","v":"2019-02-16"},{"$f":"D94+1","v":"2019-02-16"},{"$f":"IFERROR(IF(VLOOKUP(D96,tblFeiertage[Datum],1,0)=D96,\"x\"),\"\")","v":""}]
["",null,{"$f":"IFERROR(VLOOKUP($D96,tblFeiertage[],2,0),\"\")","v":""},null,{"$f":"IFERROR(IF(VLOOKUP(D97,tblFeiertage[Datum],1,0)=D97,\"x\"),\"\")","v":""}]
["",null,{"$f":"D98","v":"2019-02-17"},{"$f":"D96+1","v":"2019-02-17"},{"$f":"IFERROR(IF(VLOOKUP(D98,tblFeiertage[Datum],1,0)=D98,\"x\"),\"\")","v":""}]
["",null,{"$f":"IFERROR(VLOOKUP($D98,tblFeiertage[],2,0),\"\")","v":""},null,{"$f":"IFERROR(IF(VLOOKUP(D99,tblFeiertage[Datum],1,0)=D99,\"x\"),\"\")","v":""}]
["",{"$f":"WEEKNUM(C100)","v":8},{"$f":"D100","v":"2019-02-18"},{"$f":"D98+1","v":"2019-02-18"},{"$f":"IFERROR(IF(VLOOKUP(D100,tblFeiertage[Datum],1,0)=D100,\"x\"),\"\")","v":""}]
["",null,{"$f":"IFERROR(VLOOKUP($D100,tblFeiertage[],2,0),\"\")","v":""},null,{"$f":"IFERROR(IF(VLOOKUP(D101,tblFeiertage[Datum],1,0)=D101,\"x\"),\"\")","v":""}]
["",null,{"$f":"D102","v":"2019-02-19"},{"$f":"D100+1","v":"2019-02-19"},{"$f":"IFERROR(IF(VLOOKUP(D102,tblFeiertage[Datum],1,0)=D102,\"x\"),\"\")","v":""}]
["",null,{"$f":"IFERROR(VLOOKUP($D102,tblFeiertage[],2,0),\"\")","v":""},null,{"$f":"IFERROR(IF(VLOOKUP(D103,tblFeiertage[Datum],1,0)=D103,\"x\"),\"\")","v":""}]
["",null,{"$f":"D104","v":"2019-02-20"},{"$f":"D102+1","v":"2019-02-20"},{"$f":"IFERROR(IF(VLOOKUP(D104,tblFeiertage[Datum],1,0)=D104,\"x\"),\"\")","v":""}]
["",null,{"$f":"IFERROR(VLOOKUP($D104,tblFeiertage[],2,0),\"\")","v":""},null,{"$f":"IFERROR(IF(VLOOKUP(D105,tblFeiertage[Datum],1,0)=D105,\"x\"),\"\")","v":""}]
["",null,{"$f":"D106","v":"2019-02-21"},{"$f":"D104+1","v":"2019-02-21"},{"$f":"IFERROR(IF(VLOOKUP(D106,tblFeiertage[Datum],1,0)=D106,\"x\"),\"\")","v":""}]
["",null,{"$f":"IFERROR(VLOOKUP($D106,tblFeiertage[],2,0),\"\")","v":""},null,{"$f":"IFERROR(IF(VLOOKUP(D107,tblFeiertage[Datum],1,0)=D107,\"x\"),\"\")","v":""}]
["",null,{"$f":"D108","v":"2019-02-22"},{"$f":"D106+1","v":"2019-02-22"},{"$f":"IFERROR(IF(VLOOKUP(D108,tblFeiertage[Datum],1,0)=D108,\"x\"),\"\")","v":""}]
["",null,{"$f":"IFERROR(VLOOKUP($D108,tblFeiertage[],2,0),\"\")","v":""},null,{"$f":"IFERROR(IF(VLOOKUP(D109,tblFeiertage[Datum],1,0)=D109,\"x\"),\"\")","v":""}]
["",null,{"$f":"D110","v":"2019-02-23"},{"$f":"D108+1","v":"2019-02-23"},{"$f":"IFERROR(IF(VLOOKUP(D110,tblFeiertage[Datum],1,0)=D110,\"x\"),\"\")","v":""}]
["",null,{"$f":"IFERROR(VLOOKUP($D110,tblFeiertage[],2,0),\"\")","v":""},null,{"$f":"IFERROR(IF(VLOOKUP(D111,tblFeiertage[Datum],1,0)=D111,\"x\"),\"\")","v":""}]
["",null,{"$f":"D112","v":"2019-02-24"},{"$f":"D110+1","v":"2019-02-24"},{"$f":"IFERROR(IF(VLOOKUP(D112,tblFeiertage[Datum],1,0)=D112,\"x\"),\"\")","v":""}]
["",null,{"$f":"IFERROR(VLOOKUP($D112,tblFeiertage[],2,0),\"\")","v":""},null,{"$f":"IFERROR(IF(VLOOKUP(D113,tblFeiertage[Datum],1,0)=D113,\"x\"),\"\")","v":""}]
["",{"$f":"WEEKNUM(C114)","v":9},{"$f":"D114","v":"2019-02-25"},{"$f":"D112+1","v":"2019-02-25"},{"$f":"IFERROR(IF(VLOOKUP(D114,tblFeiertage[Datum],1,0)=D114,\"x\"),\"\")","v":""}]
["",null,{"$f":"IFERROR(VLOOKUP($D114,tblFeiertage[],2,0),\"\")","v":""},null,{"$f":"IFERROR(IF(VLOOKUP(D115,tblFeiertage[Datum],1,0)=D115,\"x\"),\"\")","v":""}]
["",null,{"$f":"D116","v":"2019-02-26"},{"$f":"D114+1","v":"2019-02-26"},{"$f":"IFERROR(IF(VLOOKUP(D116,tblFeiertage[Datum],1,0)=D116,\"x\"),\"\")","v":""}]
["",null,{"$f":"IFERROR(VLOOKUP($D116,tblFeiertage[],2,0),\"\")","v":""},null,{"$f":"IFERROR(IF(VLOOKUP(D117,tblFeiertage[Datum],1,0)=D117,\"x\"),\"\")","v":""}]
["",null,{"$f":"D118","v":"2019-02-27"},{"$f":"D116+1","v":"2019-02-27"},{"$f":"IFERROR(IF(VLOOKUP(D118,tblFeiertage[Datum],1,0)=D118,\"x\"),\"\")","v":""}]
["",null,{"$f":"IFERROR(VLOOKUP($D118,tblFeiertage[],2,0),\"\")","v":""},null,{"$f":"IFERROR(IF(VLOOKUP(D119,tblFeiertage[Datum],1,0)=D119,\"x\"),\"\")","v":""}]
["",null,{"$f":"D120","v":"2019-02-28"},{"$f":"D118+1","v":"2019-02-28"},{"$f":"IFERROR(IF(VLOOKUP(D120,tblFeiertage[Datum],1,0)=D120,\"x\"),\"\")","v":""}]
["",null,{"$f":"IFERROR(VLOOKUP($D120,tblFeiertage[],2,0),\"\")","v":""},null,{"$f":"IFERROR(IF(VLOOKUP(D121,tblFeiertage[Datum],1,0)=D121,\"x\"),\"\")","v":""}]
["2019-03-01",null,{"$f":"D122","v":"2019-03-01"},{"$f":"D120+1","v":"2019-03-01"},{"$f":"IFERROR(IF(VLOOKUP(D122,tblFeiertage[Datum],1,0)=D122,\"x\"),\"\")","v":""}]
["",null,{"$f":"IFERROR(VLOOKUP($D122,tblFeiertage[],2,0),\"\")","v":""},null,{"$f":"IFERROR(IF(VLOOKUP(D123,tblFeiertage[Datum],1,0)=D123,\"x\"),\"\")","v":""}]
["",null,{"$f":"D124","v":"2019-03-02"},{"$f":"D122+1","v":"2019-03-02"},{"$f":"IFERROR(IF(VLOOKUP(D124,tblFeiertage[Datum],1,0)=D124,\"x\"),\"\")","v":""}]
["",null,{"$f":"IFERROR(VLOOKUP($D124,tblFeiertage[],2,0),\"\")","v":""},null,{"$f":"IFERROR(IF(VLOOKUP(D125,tblFeiertage[Datum],1,0)=D125,\"x\"),\"\")","v":""}]
["",null,{"$f":"D126","v":"2019-03-03"},{"$f":"D124+1","v":"2019-03-03"},{"$f":"IFERROR(IF(VLOOKUP(D126,tblFeiertage[Datum],1,0)=D126,\"x\"),\"\")","v":""}]
["",null,{"$f":"IFERROR(VLOOKUP($D126,tblFeiertage[],2,0),\"\")","v":""},null,{"$f":"IFERROR(IF(VLOOKUP(D127,tblFeiertage[Datum],1,0)=D127,\"x\"),\"\")","v":""}]
["",{"$f":"WEEKNUM(C128)","v":10},{"$f":"D128","v":"2019-03-04"},{"$f":"D126+1","v":"2019-03-04"},{"$f":"IFERROR(IF(VLOOKUP(D128,tblFeiertage[Datum],1,0)=D128,\"x\"),\"\")","v":""}]
["",null,{"$f":"IFERROR(VLOOKUP($D128,tblFeiertage[],2,0),\"\")","v":""},null,{"$f":"IFERROR(IF(VLOOKUP(D129,tblFeiertage[Datum],1,0)=D129,\"x\"),\"\")","v":""}]
["",null,{"$f":"D130","v":"2019-03-05"},{"$f":"D128+1","v":"2019-03-05"},{"$f":"IFERROR(IF(VLOOKUP(D130,tblFeiertage[Datum],1,0)=D130,\"x\"),\"\")","v":""}]
[{"$f":"IF(DAY(D131)=1,D131,\"\")","v":""},null,{"$f":"IFERROR(VLOOKUP($D130,tblFeiertage[],2,0),\"\")","v":""},null,{"$f":"IFERROR(IF(VLOOKUP(D131,tblFeiertage[Datum],1,0)=D131,\"x\"),\"\")","v":""}]
["",null,{"$f":"D132","v":"2019-03-06"},{"$f":"D130+1","v":"2019-03-06"},{"$f":"IFERROR(IF(VLOOKUP(D132,tblFeiertage[Datum],1,0)=D132,\"x\"),\"\")","v":""}]
["",null,{"$f":"IFERROR(VLOOKUP($D132,tblFeiertage[],2,0),\"\")","v":""},null,{"$f":"IFERROR(IF(VLOOKUP(D133,tblFeiertage[Datum],1,0)=D133,\"x\"),\"\")","v":""}]
["",null,{"$f":"D134","v":"2019-03-07"},{"$f":"D132+1","v":"2019-03-07"},{"$f":"IFERROR(IF(VLOOKUP(D134,tblFeiertage[Datum],1,0)=D134,\"x\"),\"\")","v":""}]
["",null,{"$f":"IFERROR(VLOOKUP($D134,tblFeiertage[],2,0),\"\")","v":""},null,{"$f":"IFERROR(IF(VLOOKUP(D135,tblFeiertage[Datum],1,0)=D135,\"x\"),\"\")","v":""}]
["",null,{"$f":"D136","v":"2019-03-08"},{"$f":"D134+1","v":"2019-03-08"},{"$f":"IFERROR(IF(VLOOKUP(D136,tblFeiertage[Datum],1,0)=D136,\"x\"),\"\")","v":""}]
["",null,{"$f":"IFERROR(VLOOKUP($D136,tblFeiertage[],2,0),\"\")","v":""},null,{"$f":"IFERROR(IF(VLOOKUP(D137,tblFeiertage[Datum],1,0)=D137,\"x\"),\"\")","v":""}]
["",null,{"$f":"D138","v":"2019-03-09"},{"$f":"D136+1","v":"2019-03-09"},{"$f":"IFERROR(IF(VLOOKUP(D138,tblFeiertage[Datum],1,0)=D138,\"x\"),\"\")","v":""}]
["",null,{"$f":"IFERROR(VLOOKUP($D138,tblFeiertage[],2,0),\"\")","v":""},null,{"$f":"IFERROR(IF(VLOOKUP(D139,tblFeiertage[Datum],1,0)=D139,\"x\"),\"\")","v":""}]
["",null,{"$f":"D140","v":"2019-03-10"},{"$f":"D138+1","v":"2019-03-10"},{"$f":"IFERROR(IF(VLOOKUP(D140,tblFeiertage[Datum],1,0)=D140,\"x\"),\"\")","v":""}]
["",null,{"$f":"IFERROR(VLOOKUP($D140,tblFeiertage[],2,0),\"\")","v":""},null,{"$f":"IFERROR(IF(VLOOKUP(D141,tblFeiertage[Datum],1,0)=D141,\"x\"),\"\")","v":""}]
["",{"$f":"WEEKNUM(C142)","v":11},{"$f":"D142","v":"2019-03-11"},{"$f":"D140+1","v":"2019-03-11"},{"$f":"IFERROR(IF(VLOOKUP(D142,tblFeiertage[Datum],1,0)=D142,\"x\"),\"\")","v":""}]
["",null,{"$f":"IFERROR(VLOOKUP($D142,tblFeiertage[],2,0),\"\")","v":""},null,{"$f":"IFERROR(IF(VLOOKUP(D143,tblFeiertage[Datum],1,0)=D143,\"x\"),\"\")","v":""}]
["",null,{"$f":"D144","v":"2019-03-12"},{"$f":"D142+1","v":"2019-03-12"},{"$f":"IFERROR(IF(VLOOKUP(D144,tblFeiertage[Datum],1,0)=D144,\"x\"),\"\")","v":""}]
["",null,{"$f":"IFERROR(VLOOKUP($D144,tblFeiertage[],2,0),\"\")","v":""},null,{"$f":"IFERROR(IF(VLOOKUP(D145,tblFeiertage[Datum],1,0)=D145,\"x\"),\"\")","v":""}]
["",null,{"$f":"D146","v":"2019-03-13"},{"$f":"D144+1","v":"2019-03-13"},{"$f":"IFERROR(IF(VLOOKUP(D146,tblFeiertage[Datum],1,0)=D146,\"x\"),\"\")","v":""}]
["",null,{"$f":"IFERROR(VLOOKUP($D146,tblFeiertage[],2,0),\"\")","v":""},null,{"$f":"IFERROR(IF(VLOOKUP(D147,tblFeiertage[Datum],1,0)=D147,\"x\"),\"\")","v":""}]
["",null,{"$f":"D148","v":"2019-03-14"},{"$f":"D146+1","v":"2019-03-14"},{"$f":"IFERROR(IF(VLOOKUP(D148,tblFeiertage[Datum],1,0)=D148,\"x\"),\"\")","v":""}]
["",null,{"$f":"IFERROR(VLOOKUP($D148,tblFeiertage[],2,0),\"\")","v":""},null,{"$f":"IFERROR(IF(VLOOKUP(D149,tblFeiertage[Datum],1,0)=D149,\"x\"),\"\")","v":""}]
["",null,{"$f":"D150","v":"2019-03-15"},{"$f":"D148+1","v":"2019-03-15"},{"$f":"IFERROR(IF(VLOOKUP(D150,tblFeiertage[Datum],1,0)=D150,\"x\"),\"\")","v":""}]
["",null,{"$f":"IFERROR(VLOOKUP($D150,tblFeiertage[],2,0),\"\")","v":""},null,{"$f":"IFERROR(IF(VLOOKUP(D151,tblFeiertage[Datum],1,0)=D151,\"x\"),\"\")","v":""}]
["",null,{"$f":"D152","v":"2019-03-16"},{"$f":"D150+1","v":"2019-03-16"},{"$f":"IFERROR(IF(VLOOKUP(D152,tblFeiertage[Datum],1,0)=D152,\"x\"),\"\")","v":""}]
["",null,{"$f":"IFERROR(VLOOKUP($D152,tblFeiertage[],2,0),\"\")","v":""},null,{"$f":"IFERROR(IF(VLOOKUP(D153,tblFeiertage[Datum],1,0)=D153,\"x\"),\"\")","v":""}]
["",null,{"$f":"D154","v":"2019-03-17"},{"$f":"D152+1","v":"2019-03-17"},{"$f":"IFERROR(IF(VLOOKUP(D154,tblFeiertage[Datum],1,0)=D154,\"x\"),\"\")","v":""}]
["",null,{"$f":"IFERROR(VLOOKUP($D154,tblFeiertage[],2,0),\"\")","v":""},null,{"$f":"IFERROR(IF(VLOOKUP(D155,tblFeiertage[Datum],1,0)=D155,\"x\"),\"\")","v":""}]
["",{"$f":"WEEKNUM(C156)","v":12},{"$f":"D156","v":"2019-03-18"},{"$f":"D154+1","v":"2019-03-18"},{"$f":"IFERROR(IF(VLOOKUP(D156,tblFeiertage[Datum],1,0)=D156,\"x\"),\"\")","v":""}]
["",null,{"$f":"IFERROR(VLOOKUP($D156,tblFeiertage[],2,0),\"\")","v":""},null,{"$f":"IFERROR(IF(VLOOKUP(D157,tblFeiertage[Datum],1,0)=D157,\"x\"),\"\")","v":""}]
["",null,{"$f":"D158","v":"2019-03-19"},{"$f":"D156+1","v":"2019-03-19"},{"$f":"IFERROR(IF(VLOOKUP(D158,tblFeiertage[Datum],1,0)=D158,\"x\"),\"\")","v":""}]
["",null,{"$f":"IFERROR(VLOOKUP($D158,tblFeiertage[],2,0),\"\")","v":""},null,{"$f":"IFERROR(IF(VLOOKUP(D159,tblFeiertage[Datum],1,0)=D159,\"x\"),\"\")","v":""}]
["",null,{"$f":"D160","v":"2019-03-20"},{"$f":"D158+1","v":"2019-03-20"},{"$f":"IFERROR(IF(VLOOKUP(D160,tblFeiertage[Datum],1,0)=D160,\"x\"),\"\")","v":""}]
["",null,{"$f":"IFERROR(VLOOKUP($D160,tblFeiertage[],2,0),\"\")","v":""},null,{"$f":"IFERROR(IF(VLOOKUP(D161,tblFeiertage[Datum],1,0)=D161,\"x\"),\"\")","v":""},null,"Kurse / Weiterbildung"]
["",null,{"$f":"D162","v":"2019-03-21"},{"$f":"D160+1","v":"2019-03-21"},{"$f":"IFERROR(IF(VLOOKUP(D162,tblFeiertage[Datum],1,0)=D162,\"x\"),\"\")","v":""},null,"Kurse / Weiterbildung"]
["",null,{"$f":"IFERROR(VLOOKUP($D162,tblFeiertage[],2,0),\"\")","v":""},null,{"$f":"IFERROR(IF(VLOOKUP(D163,tblFeiertage[Datum],1,0)=D163,\"x\"),\"\")","v":""},null,"Kurse / Weiterbildung"]
["",null,{"$f":"D164","v":"2019-03-22"},{"$f":"D162+1","v":"2019-03-22"},{"$f":"IFERROR(IF(VLOOKUP(D164,tblFeiertage[Datum],1,0)=D164,\"x\"),\"\")","v":""},null,"Kurse / Weiterbildung"]
["",null,{"$f":"IFERROR(VLOOKUP($D164,tblFeiertage[],2,0),\"\")","v":""},null,{"$f":"IFERROR(IF(VLOOKUP(D165,tblFeiertage[Datum],1,0)=D165,\"x\"),\"\")","v":""},null,"Kurse / Weiterbildung"]
["",null,{"$f":"D166","v":"2019-03-23"},{"$f":"D164+1","v":"2019-03-23"},{"$f":"IFERROR(IF(VLOOKUP(D166,tblFeiertage[Datum],1,0)=D166,\"x\"),\"\")","v":""},null,"Kurse / Weiterbildung"]
["",null,{"$f":"IFERROR(VLOOKUP($D166,tblFeiertage[],2,0),\"\")","v":""},null,{"$f":"IFERROR(IF(VLOOKUP(D167,tblFeiertage[Datum],1,0)=D167,\"x\"),\"\")","v":""},null,"Kurse / Weiterbildung"]
["",null,{"$f":"D168","v":"2019-03-24"},{"$f":"D166+1","v":"2019-03-24"},{"$f":"IFERROR(IF(VLOOKUP(D168,tblFeiertage[Datum],1,0)=D168,\"x\"),\"\")","v":""},null,"Kurse / Weiterbildung"]
["",null,{"$f":"IFERROR(VLOOKUP($D168,tblFeiertage[],2,0),\"\")","v":""},null,{"$f":"IFERROR(IF(VLOOKUP(D169,tblFeiertage[Datum],1,0)=D169,\"x\"),\"\")","v":""},null,"Kurse / Weiterbildung"]
["",{"$f":"WEEKNUM(C170)","v":13},{"$f":"D170","v":"2019-03-25"},{"$f":"D168+1","v":"2019-03-25"},{"$f":"IFERROR(IF(VLOOKUP(D170,tblFeiertage[Datum],1,0)=D170,\"x\"),\"\")","v":""}]
["",null,{"$f":"IFERROR(VLOOKUP($D170,tblFeiertage[],2,0),\"\")","v":""},null,{"$f":"IFERROR(IF(VLOOKUP(D171,tblFeiertage[Datum],1,0)=D171,\"x\"),\"\")","v":""}]
["",null,{"$f":"D172","v":"2019-03-26"},{"$f":"D170+1","v":"2019-03-26"},{"$f":"IFERROR(IF(VLOOKUP(D172,tblFeiertage[Datum],1,0)=D172,\"x\"),\"\")","v":""}]
["",null,{"$f":"IFERROR(VLOOKUP($D172,tblFeiertage[],2,0),\"\")","v":""},null,{"$f":"IFERROR(IF(VLOOKUP(D173,tblFeiertage[Datum],1,0)=D173,\"x\"),\"\")","v":""}]
["",null,{"$f":"D174","v":"2019-03-27"},{"$f":"D172+1","v":"2019-03-27"},{"$f":"IFERROR(IF(VLOOKUP(D174,tblFeiertage[Datum],1,0)=D174,\"x\"),\"\")","v":""}]
["",null,{"$f":"IFERROR(VLOOKUP($D174,tblFeiertage[],2,0),\"\")","v":""},null,{"$f":"IFERROR(IF(VLOOKUP(D175,tblFeiertage[Datum],1,0)=D175,\"x\"),\"\")","v":""}]
["",null,{"$f":"D176","v":"2019-03-28"},{"$f":"D174+1","v":"2019-03-28"},{"$f":"IFERROR(IF(VLOOKUP(D176,tblFeiertage[Datum],1,0)=D176,\"x\"),\"\")","v":""}]
["",null,{"$f":"IFERROR(VLOOKUP($D176,tblFeiertage[],2,0),\"\")","v":""},null,{"$f":"IFERROR(IF(VLOOKUP(D177,tblFeiertage[Datum],1,0)=D177,\"x\"),\"\")","v":""}]
["",null,{"$f":"D178","v":"2019-03-29"},{"$f":"D176+1","v":"2019-03-29"},{"$f":"IFERROR(IF(VLOOKUP(D178,tblFeiertage[Datum],1,0)=D178,\"x\"),\"\")","v":""}]
["",null,{"$f":"IFERROR(VLOOKUP($D178,tblFeiertage[],2,0),\"\")","v":""},null,{"$f":"IFERROR(IF(VLOOKUP(D179,tblFeiertage[Datum],1,0)=D179,\"x\"),\"\")","v":""}]
["",null,{"$f":"D180","v":"2019-03-30"},{"$f":"D178+1","v":"2019-03-30"},{"$f":"IFERROR(IF(VLOOKUP(D180,tblFeiertage[Datum],1,0)=D180,\"x\"),\"\")","v":""}]
["",null,{"$f":"IFERROR(VLOOKUP($D180,tblFeiertage[],2,0),\"\")","v":""},null,{"$f":"IFERROR(IF(VLOOKUP(D181,tblFeiertage[Datum],1,0)=D181,\"x\"),\"\")","v":""}]
["",{"$f":"WEEKNUM(C182)","v":14},{"$f":"D182","v":"2019-03-31"},{"$f":"D180+1","v":"2019-03-31"},{"$f":"IFERROR(IF(VLOOKUP(D182,tblFeiertage[Datum],1,0)=D182,\"x\"),\"\")","v":""}]
["",null,{"$f":"IFERROR(VLOOKUP($D182,tblFeiertage[],2,0),\"\")","v":""},null,{"$f":"IFERROR(IF(VLOOKUP(D183,tblFeiertage[Datum],1,0)=D183,\"x\"),\"\")","v":""}]
["2019-04-01",null,{"$f":"D184","v":"2019-04-01"},{"$f":"D182+1","v":"2019-04-01"},{"$f":"IFERROR(IF(VLOOKUP(D184,tblFeiertage[Datum],1,0)=D184,\"x\"),\"\")","v":""}]
["",null,{"$f":"IFERROR(VLOOKUP($D184,tblFeiertage[],2,0),\"\")","v":""},null,{"$f":"IFERROR(IF(VLOOKUP(D185,tblFeiertage[Datum],1,0)=D185,\"x\"),\"\")","v":""}]
["",null,{"$f":"D186","v":"2019-04-02"},{"$f":"D184+1","v":"2019-04-02"},{"$f":"IFERROR(IF(VLOOKUP(D186,tblFeiertage[Datum],1,0)=D186,\"x\"),\"\")","v":""}]
["",null,{"$f":"IFERROR(VLOOKUP($D186,tblFeiertage[],2,0),\"\")","v":""},null,{"$f":"IFERROR(IF(VLOOKUP(D187,tblFeiertage[Datum],1,0)=D187,\"x\"),\"\")","v":""}]
["",null,{"$f":"D188","v":"2019-04-03"},{"$f":"D186+1","v":"2019-04-03"},{"$f":"IFERROR(IF(VLOOKUP(D188,tblFeiertage[Datum],1,0)=D188,\"x\"),\"\")","v":""}]
["",null,{"$f":"IFERROR(VLOOKUP($D188,tblFeiertage[],2,0),\"\")","v":""},null,{"$f":"IFERROR(IF(VLOOKUP(D189,tblFeiertage[Datum],1,0)=D189,\"x\"),\"\")","v":""}]
["",null,{"$f":"D190","v":"2019-04-04"},{"$f":"D188+1","v":"2019-04-04"},{"$f":"IFERROR(IF(VLOOKUP(D190,tblFeiertage[Datum],1,0)=D190,\"x\"),\"\")","v":""}]
["",null,{"$f":"IFERROR(VLOOKUP($D190,tblFeiertage[],2,0),\"\")","v":""},null,{"$f":"IFERROR(IF(VLOOKUP(D191,tblFeiertage[Datum],1,0)=D191,\"x\"),\"\")","v":""}]
["",null,{"$f":"D192","v":"2019-04-05"},{"$f":"D190+1","v":"2019-04-05"},{"$f":"IFERROR(IF(VLOOKUP(D192,tblFeiertage[Datum],1,0)=D192,\"x\"),\"\")","v":""}]
["",null,{"$f":"IFERROR(VLOOKUP($D192,tblFeiertage[],2,0),\"\")","v":""},null,{"$f":"IFERROR(IF(VLOOKUP(D193,tblFeiertage[Datum],1,0)=D193,\"x\"),\"\")","v":""}]
["",null,{"$f":"D194","v":"2019-04-06"},{"$f":"D192+1","v":"2019-04-06"},{"$f":"IFERROR(IF(VLOOKUP(D194,tblFeiertage[Datum],1,0)=D194,\"x\"),\"\")","v":""}]
[{"$f":"IF(DAY(D195)=1,D195,\"\")","v":""},null,{"$f":"IFERROR(VLOOKUP($D194,tblFeiertage[],2,0),\"\")","v":""},null,{"$f":"IFERROR(IF(VLOOKUP(D195,tblFeiertage[Datum],1,0)=D195,\"x\"),\"\")","v":""}]
["",{"$f":"WEEKNUM(C196)","v":15},{"$f":"D196","v":"2019-04-07"},{"$f":"D194+1","v":"2019-04-07"},{"$f":"IFERROR(IF(VLOOKUP(D196,tblFeiertage[Datum],1,0)=D196,\"x\"),\"\")","v":""}]
["",null,{"$f":"IFERROR(VLOOKUP($D196,tblFeiertage[],2,0),\"\")","v":""},null,{"$f":"IFERROR(IF(VLOOKUP(D197,tblFeiertage[Datum],1,0)=D197,\"x\"),\"\")","v":""}]
["",null,{"$f":"D198","v":"2019-04-08"},{"$f":"D196+1","v":"2019-04-08"},{"$f":"IFERROR(IF(VLOOKUP(D198,tblFeiertage[Datum],1,0)=D198,\"x\"),\"\")","v":""}]
["",null,{"$f":"IFERROR(VLOOKUP($D198,tblFeiertage[],2,0),\"\")","v":""},null,{"$f":"IFERROR(IF(VLOOKUP(D199,tblFeiertage[Datum],1,0)=D199,\"x\"),\"\")","v":""}]
["",null,{"$f":"D200","v":"2019-04-09"},{"$f":"D198+1","v":"2019-04-09"},{"$f":"IFERROR(IF(VLOOKUP(D200,tblFeiertage[Datum],1,0)=D200,\"x\"),\"\")","v":""}]
["",null,{"$f":"IFERROR(VLOOKUP($D200,tblFeiertage[],2,0),\"\")","v":""},null,{"$f":"IFERROR(IF(VLOOKUP(D201,tblFeiertage[Datum],1,0)=D201,\"x\"),\"\")","v":""}]
["",null,{"$f":"D202","v":"2019-04-10"},{"$f":"D200+1","v":"2019-04-10"},{"$f":"IFERROR(IF(VLOOKUP(D202,tblFeiertage[Datum],1,0)=D202,\"x\"),\"\")","v":""}]
["",null,{"$f":"IFERROR(VLOOKUP($D202,tblFeiertage[],2,0),\"\")","v":""},null,{"$f":"IFERROR(IF(VLOOKUP(D203,tblFeiertage[Datum],1,0)=D203,\"x\"),\"\")","v":""}]
["",null,{"$f":"D204","v":"2019-04-11"},{"$f":"D202+1","v":"2019-04-11"},{"$f":"IFERROR(IF(VLOOKUP(D204,tblFeiertage[Datum],1,0)=D204,\"x\"),\"\")","v":""}]
["",null,{"$f":"IFERROR(VLOOKUP($D204,tblFeiertage[],2,0),\"\")","v":""},null,{"$f":"IFERROR(IF(VLOOKUP(D205,tblFeiertage[Datum],1,0)=D205,\"x\"),\"\")","v":""}]
["",null,{"$f":"D206","v":"2019-04-12"},{"$f":"D204+1","v":"2019-04-12"},{"$f":"IFERROR(IF(VLOOKUP(D206,tblFeiertage[Datum],1,0)=D206,\"x\"),\"\")","v":""}]
["",null,{"$f":"IFERROR(VLOOKUP($D206,tblFeiertage[],2,0),\"\")","v":""},null,{"$f":"IFERROR(IF(VLOOKUP(D207,tblFeiertage[Datum],1,0)=D207,\"x\"),\"\")","v":""}]
["",null,{"$f":"D208","v":"2019-04-13"},{"$f":"D206+1","v":"2019-04-13"},{"$f":"IFERROR(IF(VLOOKUP(D208,tblFeiertage[Datum],1,0)=D208,\"x\"),\"\")","v":""}]
["",null,{"$f":"IFERROR(VLOOKUP($D208,tblFeiertage[],2,0),\"\")","v":""},null,{"$f":"IFERROR(IF(VLOOKUP(D209,tblFeiertage[Datum],1,0)=D209,\"x\"),\"\")","v":""}]
["",{"$f":"WEEKNUM(C210)","v":16},{"$f":"D210","v":"2019-04-14"},{"$f":"D208+1","v":"2019-04-14"},{"$f":"IFERROR(IF(VLOOKUP(D210,tblFeiertage[Datum],1,0)=D210,\"x\"),\"\")","v":""}]
["",null,{"$f":"IFERROR(VLOOKUP($D210,tblFeiertage[],2,0),\"\")","v":""},null,{"$f":"IFERROR(IF(VLOOKUP(D211,tblFeiertage[Datum],1,0)=D211,\"x\"),\"\")","v":""}]
["",null,{"$f":"D212","v":"2019-04-15"},{"$f":"D210+1","v":"2019-04-15"},{"$f":"IFERROR(IF(VLOOKUP(D212,tblFeiertage[Datum],1,0)=D212,\"x\"),\"\")","v":""}]
["",null,{"$f":"IFERROR(VLOOKUP($D212,tblFeiertage[],2,0),\"\")","v":""},null,{"$f":"IFERROR(IF(VLOOKUP(D213,tblFeiertage[Datum],1,0)=D213,\"x\"),\"\")","v":""}]
["",null,{"$f":"D214","v":"2019-04-16"},{"$f":"D212+1","v":"2019-04-16"},{"$f":"IFERROR(IF(VLOOKUP(D214,tblFeiertage[Datum],1,0)=D214,\"x\"),\"\")","v":""}]
["",null,{"$f":"IFERROR(VLOOKUP($D214,tblFeiertage[],2,0),\"\")","v":""},null,{"$f":"IFERROR(IF(VLOOKUP(D215,tblFeiertage[Datum],1,0)=D215,\"x\"),\"\")","v":""}]
["",null,{"$f":"D216","v":"2019-04-17"},{"$f":"D214+1","v":"2019-04-17"},{"$f":"IFERROR(IF(VLOOKUP(D216,tblFeiertage[Datum],1,0)=D216,\"x\"),\"\")","v":""}]
["",null,{"$f":"IFERROR(VLOOKUP($D216,tblFeiertage[],2,0),\"\")","v":""},null,{"$f":"IFERROR(IF(VLOOKUP(D217,tblFeiertage[Datum],1,0)=D217,\"x\"),\"\")","v":""}]
["",null,{"$f":"D218","v":"2019-04-18"},{"$f":"D216+1","v":"2019-04-18"},{"$f":"IFERROR(IF(VLOOKUP(D218,tblFeiertage[Datum],1,0)=D218,\"x\"),\"\")","v":""}]
["",null,{"$f":"IFERROR(VLOOKUP($D218,tblFeiertage[],2,0),\"\")","v":""},null,{"$f":"IFERROR(IF(VLOOKUP(D219,tblFeiertage[Datum],1,0)=D219,\"x\"),\"\")","v":""}]
["",null,{"$f":"D220","v":"2019-04-19"},{"$f":"D218+1","v":"2019-04-19"},{"$f":"IFERROR(IF(VLOOKUP(D220,tblFeiertage[Datum],1,0)=D220,\"x\"),\"\")","v":""}]
["",null,{"$f":"IFERROR(VLOOKUP($D220,tblFeiertage[],2,0),\"\")","v":""},null,{"$f":"IFERROR(IF(VLOOKUP(D221,tblFeiertage[Datum],1,0)=D221,\"x\"),\"\")","v":""}]
["",null,{"$f":"D222","v":"2019-04-20"},{"$f":"D220+1","v":"2019-04-20"},{"$f":"IFERROR(IF(VLOOKUP(D222,tblFeiertage[Datum],1,0)=D222,\"x\"),\"\")","v":""}]
["",null,{"$f":"IFERROR(VLOOKUP($D222,tblFeiertage[],2,0),\"\")","v":""},null,{"$f":"IFERROR(IF(VLOOKUP(D223,tblFeiertage[Datum],1,0)=D223,\"x\"),\"\")","v":""}]
["",{"$f":"WEEKNUM(C224)","v":17},{"$f":"D224","v":"2019-04-21"},{"$f":"D222+1","v":"2019-04-21"},{"$f":"IFERROR(IF(VLOOKUP(D224,tblFeiertage[Datum],1,0)=D224,\"x\"),\"\")","v":""}]
["",null,{"$f":"IFERROR(VLOOKUP($D224,tblFeiertage[],2,0),\"\")","v":""},null,{"$f":"IFERROR(IF(VLOOKUP(D225,tblFeiertage[Datum],1,0)=D225,\"x\"),\"\")","v":""}]
["",null,{"$f":"D226","v":"2019-04-22"},{"$f":"D224+1","v":"2019-04-22"},{"$f":"IFERROR(IF(VLOOKUP(D226,tblFeiertage[Datum],1,0)=D226,\"x\"),\"\")","v":""}]
["",null,{"$f":"IFERROR(VLOOKUP($D226,tblFeiertage[],2,0),\"\")","v":""},null,{"$f":"IFERROR(IF(VLOOKUP(D227,tblFeiertage[Datum],1,0)=D227,\"x\"),\"\")","v":""}]
["",null,{"$f":"D228","v":"2019-04-23"},{"$f":"D226+1","v":"2019-04-23"},{"$f":"IFERROR(IF(VLOOKUP(D228,tblFeiertage[Datum],1,0)=D228,\"x\"),\"\")","v":""}]
["",null,{"$f":"IFERROR(VLOOKUP($D228,tblFeiertage[],2,0),\"\")","v":""},null,{"$f":"IFERROR(IF(VLOOKUP(D229,tblFeiertage[Datum],1,0)=D229,\"x\"),\"\")","v":""}]
["",null,{"$f":"D230","v":"2019-04-24"},{"$f":"D228+1","v":"2019-04-24"},{"$f":"IFERROR(IF(VLOOKUP(D230,tblFeiertage[Datum],1,0)=D230,\"x\"),\"\")","v":""}]
["",null,{"$f":"IFERROR(VLOOKUP($D230,tblFeiertage[],2,0),\"\")","v":""},null,{"$f":"IFERROR(IF(VLOOKUP(D231,tblFeiertage[Datum],1,0)=D231,\"x\"),\"\")","v":""}]
["",null,{"$f":"D232","v":"2019-04-25"},{"$f":"D230+1","v":"2019-04-25"},{"$f":"IFERROR(IF(VLOOKUP(D232,tblFeiertage[Datum],1,0)=D232,\"x\"),\"\")","v":""}]
["",null,{"$f":"IFERROR(VLOOKUP($D232,tblFeiertage[],2,0),\"\")","v":""},null,{"$f":"IFERROR(IF(VLOOKUP(D233,tblFeiertage[Datum],1,0)=D233,\"x\"),\"\")","v":""}]
["",null,{"$f":"D234","v":"2019-04-26"},{"$f":"D232+1","v":"2019-04-26"},{"$f":"IFERROR(IF(VLOOKUP(D234,tblFeiertage[Datum],1,0)=D234,\"x\"),\"\")","v":""}]
["",null,{"$f":"IFERROR(VLOOKUP($D234,tblFeiertage[],2,0),\"\")","v":""},null,{"$f":"IFERROR(IF(VLOOKUP(D235,tblFeiertage[Datum],1,0)=D235,\"x\"),\"\")","v":""}]
["",null,{"$f":"D236","v":"2019-04-27"},{"$f":"D234+1","v":"2019-04-27"},{"$f":"IFERROR(IF(VLOOKUP(D236,tblFeiertage[Datum],1,0)=D236,\"x\"),\"\")","v":""}]
["",null,{"$f":"IFERROR(VLOOKUP($D236,tblFeiertage[],2,0),\"\")","v":""},null,{"$f":"IFERROR(IF(VLOOKUP(D237,tblFeiertage[Datum],1,0)=D237,\"x\"),\"\")","v":""}]
["",{"$f":"WEEKNUM(C238)","v":18},{"$f":"D238","v":"2019-04-28"},{"$f":"D236+1","v":"2019-04-28"},{"$f":"IFERROR(IF(VLOOKUP(D238,tblFeiertage[Datum],1,0)=D238,\"x\"),\"\")","v":""}]
["",null,{"$f":"IFERROR(VLOOKUP($D238,tblFeiertage[],2,0),\"\")","v":""},null,{"$f":"IFERROR(IF(VLOOKUP(D239,tblFeiertage[Datum],1,0)=D239,\"x\"),\"\")","v":""}]
["",null,{"$f":"D240","v":"2019-04-29"},{"$f":"D238+1","v":"2019-04-29"},{"$f":"IFERROR(IF(VLOOKUP(D240,tblFeiertage[Datum],1,0)=D240,\"x\"),\"\")","v":""}]
["",null,{"$f":"IFERROR(VLOOKUP($D240,tblFeiertage[],2,0),\"\")","v":""},null,{"$f":"IFERROR(IF(VLOOKUP(D241,tblFeiertage[Datum],1,0)=D241,\"x\"),\"\")","v":""}]
["",null,{"$f":"D242","v":"2019-04-30"},{"$f":"D240+1","v":"2019-04-30"},{"$f":"IFERROR(IF(VLOOKUP(D242,tblFeiertage[Datum],1,0)=D242,\"x\"),\"\")","v":""}]
["",null,{"$f":"IFERROR(VLOOKUP($D242,tblFeiertage[],2,0),\"\")","v":""},null,{"$f":"IFERROR(IF(VLOOKUP(D243,tblFeiertage[Datum],1,0)=D243,\"x\"),\"\")","v":""}]
["2019-05-01",null,{"$f":"D244","v":"2019-05-01"},{"$f":"D242+1","v":"2019-05-01"},{"$f":"IFERROR(IF(VLOOKUP(D244,tblFeiertage[Datum],1,0)=D244,\"x\"),\"\")","v":""}]
["",null,{"$f":"IFERROR(VLOOKUP($D244,tblFeiertage[],2,0),\"\")","v":""},null,{"$f":"IFERROR(IF(VLOOKUP(D245,tblFeiertage[Datum],1,0)=D245,\"x\"),\"\")","v":""}]
["",null,{"$f":"D246","v":"2019-05-02"},{"$f":"D244+1","v":"2019-05-02"},{"$f":"IFERROR(IF(VLOOKUP(D246,tblFeiertage[Datum],1,0)=D246,\"x\"),\"\")","v":""}]
["",null,{"$f":"IFERROR(VLOOKUP($D246,tblFeiertage[],2,0),\"\")","v":""},null,{"$f":"IFERROR(IF(VLOOKUP(D247,tblFeiertage[Datum],1,0)=D247,\"x\"),\"\")","v":""}]
["",null,{"$f":"D248","v":"2019-05-03"},{"$f":"D246+1","v":"2019-05-03"},{"$f":"IFERROR(IF(VLOOKUP(D248,tblFeiertage[Datum],1,0)=D248,\"x\"),\"\")","v":""}]
["",null,{"$f":"IFERROR(VLOOKUP($D248,tblFeiertage[],2,0),\"\")","v":""},null,{"$f":"IFERROR(IF(VLOOKUP(D249,tblFeiertage[Datum],1,0)=D249,\"x\"),\"\")","v":""}]
["",null,{"$f":"D250","v":"2019-05-04"},{"$f":"D248+1","v":"2019-05-04"},{"$f":"IFERROR(IF(VLOOKUP(D250,tblFeiertage[Datum],1,0)=D250,\"x\"),\"\")","v":""}]
["",null,{"$f":"IFERROR(VLOOKUP($D250,tblFeiertage[],2,0),\"\")","v":""},null,{"$f":"IFERROR(IF(VLOOKUP(D251,tblFeiertage[Datum],1,0)=D251,\"x\"),\"\")","v":""}]
["",{"$f":"WEEKNUM(C252)","v":19},{"$f":"D252","v":"2019-05-05"},{"$f":"D250+1","v":"2019-05-05"},{"$f":"IFERROR(IF(VLOOKUP(D252,tblFeiertage[Datum],1,0)=D252,\"x\"),\"\")","v":""}]
["",null,{"$f":"IFERROR(VLOOKUP($D252,tblFeiertage[],2,0),\"\")","v":""},null,{"$f":"IFERROR(IF(VLOOKUP(D253,tblFeiertage[Datum],1,0)=D253,\"x\"),\"\")","v":""}]
["",null,{"$f":"D254","v":"2019-05-06"},{"$f":"D252+1","v":"2019-05-06"},{"$f":"IFERROR(IF(VLOOKUP(D254,tblFeiertage[Datum],1,0)=D254,\"x\"),\"\")","v":""}]
["",null,{"$f":"IFERROR(VLOOKUP($D254,tblFeiertage[],2,0),\"\")","v":""},null,{"$f":"IFERROR(IF(VLOOKUP(D255,tblFeiertage[Datum],1,0)=D255,\"x\"),\"\")","v":""}]
["",null,{"$f":"D256","v":"2019-05-07"},{"$f":"D254+1","v":"2019-05-07"},{"$f":"IFERROR(IF(VLOOKUP(D256,tblFeiertage[Datum],1,0)=D256,\"x\"),\"\")","v":""}]
["",null,{"$f":"IFERROR(VLOOKUP($D256,tblFeiertage[],2,0),\"\")","v":""},null,{"$f":"IFERROR(IF(VLOOKUP(D257,tblFeiertage[Datum],1,0)=D257,\"x\"),\"\")","v":""}]
["",null,{"$f":"D258","v":"2019-05-08"},{"$f":"D256+1","v":"2019-05-08"},{"$f":"IFERROR(IF(VLOOKUP(D258,tblFeiertage[Datum],1,0)=D258,\"x\"),\"\")","v":""}]
[{"$f":"IF(DAY(D259)=1,D259,\"\")","v":""},null,{"$f":"IFERROR(VLOOKUP($D258,tblFeiertage[],2,0),\"\")","v":""},null,{"$f":"IFERROR(IF(VLOOKUP(D259,tblFeiertage[Datum],1,0)=D259,\"x\"),\"\")","v":""}]
["",null,{"$f":"D260","v":"2019-05-09"},{"$f":"D258+1","v":"2019-05-09"},{"$f":"IFERROR(IF(VLOOKUP(D260,tblFeiertage[Datum],1,0)=D260,\"x\"),\"\")","v":""}]
["",null,{"$f":"IFERROR(VLOOKUP($D260,tblFeiertage[],2,0),\"\")","v":""},null,{"$f":"IFERROR(IF(VLOOKUP(D261,tblFeiertage[Datum],1,0)=D261,\"x\"),\"\")","v":""}]
["",null,{"$f":"D262","v":"2019-05-10"},{"$f":"D260+1","v":"2019-05-10"},{"$f":"IFERROR(IF(VLOOKUP(D262,tblFeiertage[Datum],1,0)=D262,\"x\"),\"\")","v":""}]
["",null,{"$f":"IFERROR(VLOOKUP($D262,tblFeiertage[],2,0),\"\")","v":""},null,{"$f":"IFERROR(IF(VLOOKUP(D263,tblFeiertage[Datum],1,0)=D263,\"x\"),\"\")","v":""}]
["",null,{"$f":"D264","v":"2019-05-11"},{"$f":"D262+1","v":"2019-05-11"},{"$f":"IFERROR(IF(VLOOKUP(D264,tblFeiertage[Datum],1,0)=D264,\"x\"),\"\")","v":""}]
["",null,{"$f":"IFERROR(VLOOKUP($D264,tblFeiertage[],2,0),\"\")","v":""},null,{"$f":"IFERROR(IF(VLOOKUP(D265,tblFeiertage[Datum],1,0)=D265,\"x\"),\"\")","v":""}]
["",{"$f":"WEEKNUM(C266)","v":20},{"$f":"D266","v":"2019-05-12"},{"$f":"D264+1","v":"2019-05-12"},{"$f":"IFERROR(IF(VLOOKUP(D266,tblFeiertage[Datum],1,0)=D266,\"x\"),\"\")","v":""}]
["",null,{"$f":"IFERROR(VLOOKUP($D266,tblFeiertage[],2,0),\"\")","v":""},null,{"$f":"IFERROR(IF(VLOOKUP(D267,tblFeiertage[Datum],1,0)=D267,\"x\"),\"\")","v":""}]
["",null,{"$f":"D268","v":"2019-05-13"},{"$f":"D266+1","v":"2019-05-13"},{"$f":"IFERROR(IF(VLOOKUP(D268,tblFeiertage[Datum],1,0)=D268,\"x\"),\"\")","v":""}]
["",null,{"$f":"IFERROR(VLOOKUP($D268,tblFeiertage[],2,0),\"\")","v":""},null,{"$f":"IFERROR(IF(VLOOKUP(D269,tblFeiertage[Datum],1,0)=D269,\"x\"),\"\")","v":""}]
["",null,{"$f":"D270","v":"2019-05-14"},{"$f":"D268+1","v":"2019-05-14"},{"$f":"IFERROR(IF(VLOOKUP(D270,tblFeiertage[Datum],1,0)=D270,\"x\"),\"\")","v":""}]
["",null,{"$f":"IFERROR(VLOOKUP($D270,tblFeiertage[],2,0),\"\")","v":""},null,{"$f":"IFERROR(IF(VLOOKUP(D271,tblFeiertage[Datum],1,0)=D271,\"x\"),\"\")","v":""}]
["",null,{"$f":"D272","v":"2019-05-15"},{"$f":"D270+1","v":"2019-05-15"},{"$f":"IFERROR(IF(VLOOKUP(D272,tblFeiertage[Datum],1,0)=D272,\"x\"),\"\")","v":""}]
["",null,{"$f":"IFERROR(VLOOKUP($D272,tblFeiertage[],2,0),\"\")","v":""},null,{"$f":"IFERROR(IF(VLOOKUP(D273,tblFeiertage[Datum],1,0)=D273,\"x\"),\"\")","v":""}]
["",null,{"$f":"D274","v":"2019-05-16"},{"$f":"D272+1","v":"2019-05-16"},{"$f":"IFERROR(IF(VLOOKUP(D274,tblFeiertage[Datum],1,0)=D274,\"x\"),\"\")","v":""}]
["",null,{"$f":"IFERROR(VLOOKUP($D274,tblFeiertage[],2,0),\"\")","v":""},null,{"$f":"IFERROR(IF(VLOOKUP(D275,tblFeiertage[Datum],1,0)=D275,\"x\"),\"\")","v":""}]
["",null,{"$f":"D276","v":"2019-05-17"},{"$f":"D274+1","v":"2019-05-17"},{"$f":"IFERROR(IF(VLOOKUP(D276,tblFeiertage[Datum],1,0)=D276,\"x\"),\"\")","v":""}]
["",null,{"$f":"IFERROR(VLOOKUP($D276,tblFeiertage[],2,0),\"\")","v":""},null,{"$f":"IFERROR(IF(VLOOKUP(D277,tblFeiertage[Datum],1,0)=D277,\"x\"),\"\")","v":""}]
["",null,{"$f":"D278","v":"2019-05-18"},{"$f":"D276+1","v":"2019-05-18"},{"$f":"IFERROR(IF(VLOOKUP(D278,tblFeiertage[Datum],1,0)=D278,\"x\"),\"\")","v":""}]
["",null,{"$f":"IFERROR(VLOOKUP($D278,tblFeiertage[],2,0),\"\")","v":""},null,{"$f":"IFERROR(IF(VLOOKUP(D279,tblFeiertage[Datum],1,0)=D279,\"x\"),\"\")","v":""}]
["",{"$f":"WEEKNUM(C280)","v":21},{"$f":"D280","v":"2019-05-19"},{"$f":"D278+1","v":"2019-05-19"},{"$f":"IFERROR(IF(VLOOKUP(D280,tblFeiertage[Datum],1,0)=D280,\"x\"),\"\")","v":""}]
["",null,{"$f":"IFERROR(VLOOKUP($D280,tblFeiertage[],2,0),\"\")","v":""},null,{"$f":"IFERROR(IF(VLOOKUP(D281,tblFeiertage[Datum],1,0)=D281,\"x\"),\"\")","v":""}]
["",null,{"$f":"D282","v":"2019-05-20"},{"$f":"D280+1","v":"2019-05-20"},{"$f":"IFERROR(IF(VLOOKUP(D282,tblFeiertage[Datum],1,0)=D282,\"x\"),\"\")","v":""}]
["",null,{"$f":"IFERROR(VLOOKUP($D282,tblFeiertage[],2,0),\"\")","v":""},null,{"$f":"IFERROR(IF(VLOOKUP(D283,tblFeiertage[Datum],1,0)=D283,\"x\"),\"\")","v":""}]
["",null,{"$f":"D284","v":"2019-05-21"},{"$f":"D282+1","v":"2019-05-21"},{"$f":"IFERROR(IF(VLOOKUP(D284,tblFeiertage[Datum],1,0)=D284,\"x\"),\"\")","v":""}]
["",null,{"$f":"IFERROR(VLOOKUP($D284,tblFeiertage[],2,0),\"\")","v":""},null,{"$f":"IFERROR(IF(VLOOKUP(D285,tblFeiertage[Datum],1,0)=D285,\"x\"),\"\")","v":""}]
["",null,{"$f":"D286","v":"2019-05-22"},{"$f":"D284+1","v":"2019-05-22"},{"$f":"IFERROR(IF(VLOOKUP(D286,tblFeiertage[Datum],1,0)=D286,\"x\"),\"\")","v":""}]
["",null,{"$f":"IFERROR(VLOOKUP($D286,tblFeiertage[],2,0),\"\")","v":""},null,{"$f":"IFERROR(IF(VLOOKUP(D287,tblFeiertage[Datum],1,0)=D287,\"x\"),\"\")","v":""}]
["",null,{"$f":"D288","v":"2019-05-23"},{"$f":"D286+1","v":"2019-05-23"},{"$f":"IFERROR(IF(VLOOKUP(D288,tblFeiertage[Datum],1,0)=D288,\"x\"),\"\")","v":""}]
["",null,{"$f":"IFERROR(VLOOKUP($D288,tblFeiertage[],2,0),\"\")","v":""},null,{"$f":"IFERROR(IF(VLOOKUP(D289,tblFeiertage[Datum],1,0)=D289,\"x\"),\"\")","v":""}]
["",null,{"$f":"D290","v":"2019-05-24"},{"$f":"D288+1","v":"2019-05-24"},{"$f":"IFERROR(IF(VLOOKUP(D290,tblFeiertage[Datum],1,0)=D290,\"x\"),\"\")","v":""}]
["",null,{"$f":"IFERROR(VLOOKUP($D290,tblFeiertage[],2,0),\"\")","v":""},null,{"$f":"IFERROR(IF(VLOOKUP(D291,tblFeiertage[Datum],1,0)=D291,\"x\"),\"\")","v":""}]
["",null,{"$f":"D292","v":"2019-05-25"},{"$f":"D290+1","v":"2019-05-25"},{"$f":"IFERROR(IF(VLOOKUP(D292,tblFeiertage[Datum],1,0)=D292,\"x\"),\"\")","v":""}]
["",null,{"$f":"IFERROR(VLOOKUP($D292,tblFeiertage[],2,0),\"\")","v":""},null,{"$f":"IFERROR(IF(VLOOKUP(D293,tblFeiertage[Datum],1,0)=D293,\"x\"),\"\")","v":""}]
["",{"$f":"WEEKNUM(C294)","v":22},{"$f":"D294","v":"2019-05-26"},{"$f":"D292+1","v":"2019-05-26"},{"$f":"IFERROR(IF(VLOOKUP(D294,tblFeiertage[Datum],1,0)=D294,\"x\"),\"\")","v":""}]
["",null,{"$f":"IFERROR(VLOOKUP($D294,tblFeiertage[],2,0),\"\")","v":""},null,{"$f":"IFERROR(IF(VLOOKUP(D295,tblFeiertage[Datum],1,0)=D295,\"x\"),\"\")","v":""}]
["",null,{"$f":"D296","v":"2019-05-27"},{"$f":"D294+1","v":"2019-05-27"},{"$f":"IFERROR(IF(VLOOKUP(D296,tblFeiertage[Datum],1,0)=D296,\"x\"),\"\")","v":""}]
["",null,{"$f":"IFERROR(VLOOKUP($D296,tblFeiertage[],2,0),\"\")","v":""},null,{"$f":"IFERROR(IF(VLOOKUP(D297,tblFeiertage[Datum],1,0)=D297,\"x\"),\"\")","v":""}]
["",null,{"$f":"D298","v":"2019-05-28"},{"$f":"D296+1","v":"2019-05-28"},{"$f":"IFERROR(IF(VLOOKUP(D298,tblFeiertage[Datum],1,0)=D298,\"x\"),\"\")","v":""}]
["",null,{"$f":"IFERROR(VLOOKUP($D298,tblFeiertage[],2,0),\"\")","v":""},null,{"$f":"IFERROR(IF(VLOOKUP(D299,tblFeiertage[Datum],1,0)=D299,\"x\"),\"\")","v":""}]
["",null,{"$f":"D300","v":"2019-05-29"},{"$f":"D298+1","v":"2019-05-29"},{"$f":"IFERROR(IF(VLOOKUP(D300,tblFeiertage[Datum],1,0)=D300,\"x\"),\"\")","v":""}]
["",null,{"$f":"IFERROR(VLOOKUP($D300,tblFeiertage[],2,0),\"\")","v":""},null,{"$f":"IFERROR(IF(VLOOKUP(D301,tblFeiertage[Datum],1,0)=D301,\"x\"),\"\")","v":""}]
["",null,{"$f":"D302","v":"2019-05-30"},{"$f":"D300+1","v":"2019-05-30"},{"$f":"IFERROR(IF(VLOOKUP(D302,tblFeiertage[Datum],1,0)=D302,\"x\"),\"\")","v":""}]
["",null,{"$f":"IFERROR(VLOOKUP($D302,tblFeiertage[],2,0),\"\")","v":""},null,{"$f":"IFERROR(IF(VLOOKUP(D303,tblFeiertage[Datum],1,0)=D303,\"x\"),\"\")","v":""}]
["",null,{"$f":"D304","v":"2019-05-31"},{"$f":"D302+1","v":"2019-05-31"},{"$f":"IFERROR(IF(VLOOKUP(D304,tblFeiertage[Datum],1,0)=D304,\"x\"),\"\")","v":""}]
["",null,{"$f":"IFERROR(VLOOKUP($D304,tblFeiertage[],2,0),\"\")","v":""},null,{"$f":"IFERROR(IF(VLOOKUP(D305,tblFeiertage[Datum],1,0)=D305,\"x\"),\"\")","v":""}]
["2019-06-01",null,{"$f":"D306","v":"2019-06-01"},{"$f":"D304+1","v":"2019-06-01"},{"$f":"IFERROR(IF(VLOOKUP(D306,tblFeiertage[Datum],1,0)=D306,\"x\"),\"\")","v":""}]
["",null,{"$f":"IFERROR(VLOOKUP($D306,tblFeiertage[],2,0),\"\")","v":""},null,{"$f":"IFERROR(IF(VLOOKUP(D307,tblFeiertage[Datum],1,0)=D307,\"x\"),\"\")","v":""}]
["",{"$f":"WEEKNUM(C308)","v":23},{"$f":"D308","v":"2019-06-02"},{"$f":"D306+1","v":"2019-06-02"},{"$f":"IFERROR(IF(VLOOKUP(D308,tblFeiertage[Datum],1,0)=D308,\"x\"),\"\")","v":""}]
["",null,{"$f":"IFERROR(VLOOKUP($D308,tblFeiertage[],2,0),\"\")","v":""},null,{"$f":"IFERROR(IF(VLOOKUP(D309,tblFeiertage[Datum],1,0)=D309,\"x\"),\"\")","v":""}]
["",null,{"$f":"D310","v":"2019-06-03"},{"$f":"D308+1","v":"2019-06-03"},{"$f":"IFERROR(IF(VLOOKUP(D310,tblFeiertage[Datum],1,0)=D310,\"x\"),\"\")","v":""}]
["",null,{"$f":"IFERROR(VLOOKUP($D310,tblFeiertage[],2,0),\"\")","v":""},null,{"$f":"IFERROR(IF(VLOOKUP(D311,tblFeiertage[Datum],1,0)=D311,\"x\"),\"\")","v":""}]
["",null,{"$f":"D312","v":"2019-06-04"},{"$f":"D310+1","v":"2019-06-04"},{"$f":"IFERROR(IF(VLOOKUP(D312,tblFeiertage[Datum],1,0)=D312,\"x\"),\"\")","v":""}]
["",null,{"$f":"IFERROR(VLOOKUP($D312,tblFeiertage[],2,0),\"\")","v":""},null,{"$f":"IFERROR(IF(VLOOKUP(D313,tblFeiertage[Datum],1,0)=D313,\"x\"),\"\")","v":""}]
["",null,{"$f":"D314","v":"2019-06-05"},{"$f":"D312+1","v":"2019-06-05"},{"$f":"IFERROR(IF(VLOOKUP(D314,tblFeiertage[Datum],1,0)=D314,\"x\"),\"\")","v":""}]
["",null,{"$f":"IFERROR(VLOOKUP($D314,tblFeiertage[],2,0),\"\")","v":""},null,{"$f":"IFERROR(IF(VLOOKUP(D315,tblFeiertage[Datum],1,0)=D315,\"x\"),\"\")","v":""}]
["",null,{"$f":"D316","v":"2019-06-06"},{"$f":"D314+1","v":"2019-06-06"},{"$f":"IFERROR(IF(VLOOKUP(D316,tblFeiertage[Datum],1,0)=D316,\"x\"),\"\")","v":""}]
["",null,{"$f":"IFERROR(VLOOKUP($D316,tblFeiertage[],2,0),\"\")","v":""},null,{"$f":"IFERROR(IF(VLOOKUP(D317,tblFeiertage[Datum],1,0)=D317,\"x\"),\"\")","v":""}]
["",null,{"$f":"D318","v":"2019-06-07"},{"$f":"D316+1","v":"2019-06-07"},{"$f":"IFERROR(IF(VLOOKUP(D318,tblFeiertage[Datum],1,0)=D318,\"x\"),\"\")","v":""}]
["",null,{"$f":"IFERROR(VLOOKUP($D318,tblFeiertage[],2,0),\"\")","v":""},null,{"$f":"IFERROR(IF(VLOOKUP(D319,tblFeiertage[Datum],1,0)=D319,\"x\"),\"\")","v":""}]
["",null,{"$f":"D320","v":"2019-06-08"},{"$f":"D318+1","v":"2019-06-08"},{"$f":"IFERROR(IF(VLOOKUP(D320,tblFeiertage[Datum],1,0)=D320,\"x\"),\"\")","v":""}]
["",null,{"$f":"IFERROR(VLOOKUP($D320,tblFeiertage[],2,0),\"\")","v":""},null,{"$f":"IFERROR(IF(VLOOKUP(D321,tblFeiertage[Datum],1,0)=D321,\"x\"),\"\")","v":""}]
["",{"$f":"WEEKNUM(C322)","v":24},{"$f":"D322","v":"2019-06-09"},{"$f":"D320+1","v":"2019-06-09"},{"$f":"IFERROR(IF(VLOOKUP(D322,tblFeiertage[Datum],1,0)=D322,\"x\"),\"\")","v":""}]
[{"$f":"IF(DAY(D323)=1,D323,\"\")","v":""},null,{"$f":"IFERROR(VLOOKUP($D322,tblFeiertage[],2,0),\"\")","v":""},null,{"$f":"IFERROR(IF(VLOOKUP(D323,tblFeiertage[Datum],1,0)=D323,\"x\"),\"\")","v":""}]
["",null,{"$f":"D324","v":"2019-06-10"},{"$f":"D322+1","v":"2019-06-10"},{"$f":"IFERROR(IF(VLOOKUP(D324,tblFeiertage[Datum],1,0)=D324,\"x\"),\"\")","v":""}]
["",null,{"$f":"IFERROR(VLOOKUP($D324,tblFeiertage[],2,0),\"\")","v":""},null,{"$f":"IFERROR(IF(VLOOKUP(D325,tblFeiertage[Datum],1,0)=D325,\"x\"),\"\")","v":""}]
["",null,{"$f":"D326","v":"2019-06-11"},{"$f":"D324+1","v":"2019-06-11"},{"$f":"IFERROR(IF(VLOOKUP(D326,tblFeiertage[Datum],1,0)=D326,\"x\"),\"\")","v":""}]
["",null,{"$f":"IFERROR(VLOOKUP($D326,tblFeiertage[],2,0),\"\")","v":""},null,{"$f":"IFERROR(IF(VLOOKUP(D327,tblFeiertage[Datum],1,0)=D327,\"x\"),\"\")","v":""}]
["",null,{"$f":"D328","v":"2019-06-12"},{"$f":"D326+1","v":"2019-06-12"},{"$f":"IFERROR(IF(VLOOKUP(D328,tblFeiertage[Datum],1,0)=D328,\"x\"),\"\")","v":""}]
["",null,{"$f":"IFERROR(VLOOKUP($D328,tblFeiertage[],2,0),\"\")","v":""},null,{"$f":"IFERROR(IF(VLOOKUP(D329,tblFeiertage[Datum],1,0)=D329,\"x\"),\"\")","v":""}]
["",null,{"$f":"D330","v":"2019-06-13"},{"$f":"D328+1","v":"2019-06-13"},{"$f":"IFERROR(IF(VLOOKUP(D330,tblFeiertage[Datum],1,0)=D330,\"x\"),\"\")","v":""}]
["",null,{"$f":"IFERROR(VLOOKUP($D330,tblFeiertage[],2,0),\"\")","v":""},null,{"$f":"IFERROR(IF(VLOOKUP(D331,tblFeiertage[Datum],1,0)=D331,\"x\"),\"\")","v":""}]
["",null,{"$f":"D332","v":"2019-06-14"},{"$f":"D330+1","v":"2019-06-14"},{"$f":"IFERROR(IF(VLOOKUP(D332,tblFeiertage[Datum],1,0)=D332,\"x\"),\"\")","v":""}]
["",null,{"$f":"IFERROR(VLOOKUP($D332,tblFeiertage[],2,0),\"\")","v":""},null,{"$f":"IFERROR(IF(VLOOKUP(D333,tblFeiertage[Datum],1,0)=D333,\"x\"),\"\")","v":""}]
["",null,{"$f":"D334","v":"2019-06-15"},{"$f":"D332+1","v":"2019-06-15"},{"$f":"IFERROR(IF(VLOOKUP(D334,tblFeiertage[Datum],1,0)=D334,\"x\"),\"\")","v":""}]
["",null,{"$f":"IFERROR(VLOOKUP($D334,tblFeiertage[],2,0),\"\")","v":""},null,{"$f":"IFERROR(IF(VLOOKUP(D335,tblFeiertage[Datum],1,0)=D335,\"x\"),\"\")","v":""}]
["",{"$f":"WEEKNUM(C336)","v":25},{"$f":"D336","v":"2019-06-16"},{"$f":"D334+1","v":"2019-06-16"},{"$f":"IFERROR(IF(VLOOKUP(D336,tblFeiertage[Datum],1,0)=D336,\"x\"),\"\")","v":""}]
["",null,{"$f":"IFERROR(VLOOKUP($D336,tblFeiertage[],2,0),\"\")","v":""},null,{"$f":"IFERROR(IF(VLOOKUP(D337,tblFeiertage[Datum],1,0)=D337,\"x\"),\"\")","v":""}]
["",null,{"$f":"D338","v":"2019-06-17"},{"$f":"D336+1","v":"2019-06-17"},{"$f":"IFERROR(IF(VLOOKUP(D338,tblFeiertage[Datum],1,0)=D338,\"x\"),\"\")","v":""}]
["",null,{"$f":"IFERROR(VLOOKUP($D338,tblFeiertage[],2,0),\"\")","v":""},null,{"$f":"IFERROR(IF(VLOOKUP(D339,tblFeiertage[Datum],1,0)=D339,\"x\"),\"\")","v":""}]
["",null,{"$f":"D340","v":"2019-06-18"},{"$f":"D338+1","v":"2019-06-18"},{"$f":"IFERROR(IF(VLOOKUP(D340,tblFeiertage[Datum],1,0)=D340,\"x\"),\"\")","v":""}]
["",null,{"$f":"IFERROR(VLOOKUP($D340,tblFeiertage[],2,0),\"\")","v":""},null,{"$f":"IFERROR(IF(VLOOKUP(D341,tblFeiertage[Datum],1,0)=D341,\"x\"),\"\")","v":""}]
["",null,{"$f":"D342","v":"2019-06-19"},{"$f":"D340+1","v":"2019-06-19"},{"$f":"IFERROR(IF(VLOOKUP(D342,tblFeiertage[Datum],1,0)=D342,\"x\"),\"\")","v":""}]
["",null,{"$f":"IFERROR(VLOOKUP($D342,tblFeiertage[],2,0),\"\")","v":""},null,{"$f":"IFERROR(IF(VLOOKUP(D343,tblFeiertage[Datum],1,0)=D343,\"x\"),\"\")","v":""}]
["",null,{"$f":"D344","v":"2019-06-20"},{"$f":"D342+1","v":"2019-06-20"},{"$f":"IFERROR(IF(VLOOKUP(D344,tblFeiertage[Datum],1,0)=D344,\"x\"),\"\")","v":""}]
["",null,{"$f":"IFERROR(VLOOKUP($D344,tblFeiertage[],2,0),\"\")","v":""},null,{"$f":"IFERROR(IF(VLOOKUP(D345,tblFeiertage[Datum],1,0)=D345,\"x\"),\"\")","v":""}]
["",null,{"$f":"D346","v":"2019-06-21"},{"$f":"D344+1","v":"2019-06-21"},{"$f":"IFERROR(IF(VLOOKUP(D346,tblFeiertage[Datum],1,0)=D346,\"x\"),\"\")","v":""}]
["",null,{"$f":"IFERROR(VLOOKUP($D346,tblFeiertage[],2,0),\"\")","v":""},null,{"$f":"IFERROR(IF(VLOOKUP(D347,tblFeiertage[Datum],1,0)=D347,\"x\"),\"\")","v":""}]
["",null,{"$f":"D348","v":"2019-06-22"},{"$f":"D346+1","v":"2019-06-22"},{"$f":"IFERROR(IF(VLOOKUP(D348,tblFeiertage[Datum],1,0)=D348,\"x\"),\"\")","v":""}]
["",null,{"$f":"IFERROR(VLOOKUP($D348,tblFeiertage[],2,0),\"\")","v":""},null,{"$f":"IFERROR(IF(VLOOKUP(D349,tblFeiertage[Datum],1,0)=D349,\"x\"),\"\")","v":""}]
["",{"$f":"WEEKNUM(C350)","v":26},{"$f":"D350","v":"2019-06-23"},{"$f":"D348+1","v":"2019-06-23"},{"$f":"IFERROR(IF(VLOOKUP(D350,tblFeiertage[Datum],1,0)=D350,\"x\"),\"\")","v":""}]
["",null,{"$f":"IFERROR(VLOOKUP($D350,tblFeiertage[],2,0),\"\")","v":""},null,{"$f":"IFERROR(IF(VLOOKUP(D351,tblFeiertage[Datum],1,0)=D351,\"x\"),\"\")","v":""}]
["",null,{"$f":"D352","v":"2019-06-24"},{"$f":"D350+1","v":"2019-06-24"},{"$f":"IFERROR(IF(VLOOKUP(D352,tblFeiertage[Datum],1,0)=D352,\"x\"),\"\")","v":""}]
["",null,{"$f":"IFERROR(VLOOKUP($D352,tblFeiertage[],2,0),\"\")","v":""},null,{"$f":"IFERROR(IF(VLOOKUP(D353,tblFeiertage[Datum],1,0)=D353,\"x\"),\"\")","v":""}]
["",null,{"$f":"D354","v":"2019-06-25"},{"$f":"D352+1","v":"2019-06-25"},{"$f":"IFERROR(IF(VLOOKUP(D354,tblFeiertage[Datum],1,0)=D354,\"x\"),\"\")","v":""}]
["",null,{"$f":"IFERROR(VLOOKUP($D354,tblFeiertage[],2,0),\"\")","v":""},null,{"$f":"IFERROR(IF(VLOOKUP(D355,tblFeiertage[Datum],1,0)=D355,\"x\"),\"\")","v":""}]
["",null,{"$f":"D356","v":"2019-06-26"},{"$f":"D354+1","v":"2019-06-26"},{"$f":"IFERROR(IF(VLOOKUP(D356,tblFeiertage[Datum],1,0)=D356,\"x\"),\"\")","v":""}]
["",null,{"$f":"IFERROR(VLOOKUP($D356,tblFeiertage[],2,0),\"\")","v":""},null,{"$f":"IFERROR(IF(VLOOKUP(D357,tblFeiertage[Datum],1,0)=D357,\"x\"),\"\")","v":""}]
["",null,{"$f":"D358","v":"2019-06-27"},{"$f":"D356+1","v":"2019-06-27"},{"$f":"IFERROR(IF(VLOOKUP(D358,tblFeiertage[Datum],1,0)=D358,\"x\"),\"\")","v":""}]
["",null,{"$f":"IFERROR(VLOOKUP($D358,tblFeiertage[],2,0),\"\")","v":""},null,{"$f":"IFERROR(IF(VLOOKUP(D359,tblFeiertage[Datum],1,0)=D359,\"x\"),\"\")","v":""}]
["",null,{"$f":"D360","v":"2019-06-28"},{"$f":"D358+1","v":"2019-06-28"},{"$f":"IFERROR(IF(VLOOKUP(D360,tblFeiertage[Datum],1,0)=D360,\"x\"),\"\")","v":""}]
["",null,{"$f":"IFERROR(VLOOKUP($D360,tblFeiertage[],2,0),\"\")","v":""},null,{"$f":"IFERROR(IF(VLOOKUP(D361,tblFeiertage[Datum],1,0)=D361,\"x\"),\"\")","v":""}]
["",null,{"$f":"D362","v":"2019-06-29"},{"$f":"D360+1","v":"2019-06-29"},{"$f":"IFERROR(IF(VLOOKUP(D362,tblFeiertage[Datum],1,0)=D362,\"x\"),\"\")","v":""}]
["",null,{"$f":"IFERROR(VLOOKUP($D362,tblFeiertage[],2,0),\"\")","v":""},null,{"$f":"IFERROR(IF(VLOOKUP(D363,tblFeiertage[Datum],1,0)=D363,\"x\"),\"\")","v":""}]
["",{"$f":"WEEKNUM(C364)","v":27},{"$f":"D364","v":"2019-06-30"},{"$f":"D362+1","v":"2019-06-30"},{"$f":"IFERROR(IF(VLOOKUP(D364,tblFeiertage[Datum],1,0)=D364,\"x\"),\"\")","v":""}]
["",null,{"$f":"IFERROR(VLOOKUP($D364,tblFeiertage[],2,0),\"\")","v":""},null,{"$f":"IFERROR(IF(VLOOKUP(D365,tblFeiertage[Datum],1,0)=D365,\"x\"),\"\")","v":""}]
["2019-07-01",null,{"$f":"D366","v":"2019-07-01"},{"$f":"D364+1","v":"2019-07-01"},{"$f":"IFERROR(IF(VLOOKUP(D366,tblFeiertage[Datum],1,0)=D366,\"x\"),\"\")","v":""}]
["",null,{"$f":"IFERROR(VLOOKUP($D366,tblFeiertage[],2,0),\"\")","v":""},null,{"$f":"IFERROR(IF(VLOOKUP(D367,tblFeiertage[Datum],1,0)=D367,\"x\"),\"\")","v":""}]
["",null,{"$f":"D368","v":"2019-07-02"},{"$f":"D366+1","v":"2019-07-02"},{"$f":"IFERROR(IF(VLOOKUP(D368,tblFeiertage[Datum],1,0)=D368,\"x\"),\"\")","v":""}]
["",null,{"$f":"IFERROR(VLOOKUP($D368,tblFeiertage[],2,0),\"\")","v":""},null,{"$f":"IFERROR(IF(VLOOKUP(D369,tblFeiertage[Datum],1,0)=D369,\"x\"),\"\")","v":""}]
["",null,{"$f":"D370","v":"2019-07-03"},{"$f":"D368+1","v":"2019-07-03"},{"$f":"IFERROR(IF(VLOOKUP(D370,tblFeiertage[Datum],1,0)=D370,\"x\"),\"\")","v":""}]
["",null,{"$f":"IFERROR(VLOOKUP($D370,tblFeiertage[],2,0),\"\")","v":""},null,{"$f":"IFERROR(IF(VLOOKUP(D371,tblFeiertage[Datum],1,0)=D371,\"x\"),\"\")","v":""}]
["",null,{"$f":"D372","v":"2019-07-04"},{"$f":"D370+1","v":"2019-07-04"},{"$f":"IFERROR(IF(VLOOKUP(D372,tblFeiertage[Datum],1,0)=D372,\"x\"),\"\")","v":""}]
["",null,{"$f":"IFERROR(VLOOKUP($D372,tblFeiertage[],2,0),\"\")","v":""},null,{"$f":"IFERROR(IF(VLOOKUP(D373,tblFeiertage[Datum],1,0)=D373,\"x\"),\"\")","v":""}]
["",null,{"$f":"D374","v":"2019-07-05"},{"$f":"D372+1","v":"2019-07-05"},{"$f":"IFERROR(IF(VLOOKUP(D374,tblFeiertage[Datum],1,0)=D374,\"x\"),\"\")","v":""}]
["",null,{"$f":"IFERROR(VLOOKUP($D374,tblFeiertage[],2,0),\"\")","v":""},null,{"$f":"IFERROR(IF(VLOOKUP(D375,tblFeiertage[Datum],1,0)=D375,\"x\"),\"\")","v":""}]
["",null,{"$f":"D376","v":"2019-07-06"},{"$f":"D374+1","v":"2019-07-06"},{"$f":"IFERROR(IF(VLOOKUP(D376,tblFeiertage[Datum],1,0)=D376,\"x\"),\"\")","v":""}]
["",null,{"$f":"IFERROR(VLOOKUP($D376,tblFeiertage[],2,0),\"\")","v":""},null,{"$f":"IFERROR(IF(VLOOKUP(D377,tblFeiertage[Datum],1,0)=D377,\"x\"),\"\")","v":""}]
["",{"$f":"WEEKNUM(C378)","v":28},{"$f":"D378","v":"2019-07-07"},{"$f":"D376+1","v":"2019-07-07"},{"$f":"IFERROR(IF(VLOOKUP(D378,tblFeiertage[Datum],1,0)=D378,\"x\"),\"\")","v":""}]
["",null,{"$f":"IFERROR(VLOOKUP($D378,tblFeiertage[],2,0),\"\")","v":""},null,{"$f":"IFERROR(IF(VLOOKUP(D379,tblFeiertage[Datum],1,0)=D379,\"x\"),\"\")","v":""}]
["",null,{"$f":"D380","v":"2019-07-08"},{"$f":"D378+1","v":"2019-07-08"},{"$f":"IFERROR(IF(VLOOKUP(D380,tblFeiertage[Datum],1,0)=D380,\"x\"),\"\")","v":""}]
["",null,{"$f":"IFERROR(VLOOKUP($D380,tblFeiertage[],2,0),\"\")","v":""},null,{"$f":"IFERROR(IF(VLOOKUP(D381,tblFeiertage[Datum],1,0)=D381,\"x\"),\"\")","v":""}]
["",null,{"$f":"D382","v":"2019-07-09"},{"$f":"D380+1","v":"2019-07-09"},{"$f":"IFERROR(IF(VLOOKUP(D382,tblFeiertage[Datum],1,0)=D382,\"x\"),\"\")","v":""}]
["",null,{"$f":"IFERROR(VLOOKUP($D382,tblFeiertage[],2,0),\"\")","v":""},null,{"$f":"IFERROR(IF(VLOOKUP(D383,tblFeiertage[Datum],1,0)=D383,\"x\"),\"\")","v":""}]
["",null,{"$f":"D384","v":"2019-07-10"},{"$f":"D382+1","v":"2019-07-10"},{"$f":"IFERROR(IF(VLOOKUP(D384,tblFeiertage[Datum],1,0)=D384,\"x\"),\"\")","v":""}]
["",null,{"$f":"IFERROR(VLOOKUP($D384,tblFeiertage[],2,0),\"\")","v":""},null,{"$f":"IFERROR(IF(VLOOKUP(D385,tblFeiertage[Datum],1,0)=D385,\"x\"),\"\")","v":""}]
["",null,{"$f":"D386","v":"2019-07-11"},{"$f":"D384+1","v":"2019-07-11"},{"$f":"IFERROR(IF(VLOOKUP(D386,tblFeiertage[Datum],1,0)=D386,\"x\"),\"\")","v":""}]
[{"$f":"IF(DAY(D387)=1,D387,\"\")","v":""},null,{"$f":"IFERROR(VLOOKUP($D386,tblFeiertage[],2,0),\"\")","v":""},null,{"$f":"IFERROR(IF(VLOOKUP(D387,tblFeiertage[Datum],1,0)=D387,\"x\"),\"\")","v":""}]
["",null,{"$f":"D388","v":"2019-07-12"},{"$f":"D386+1","v":"2019-07-12"},{"$f":"IFERROR(IF(VLOOKUP(D388,tblFeiertage[Datum],1,0)=D388,\"x\"),\"\")","v":""}]
["",null,{"$f":"IFERROR(VLOOKUP($D388,tblFeiertage[],2,0),\"\")","v":""},null,{"$f":"IFERROR(IF(VLOOKUP(D389,tblFeiertage[Datum],1,0)=D389,\"x\"),\"\")","v":""}]
["",null,{"$f":"D390","v":"2019-07-13"},{"$f":"D388+1","v":"2019-07-13"},{"$f":"IFERROR(IF(VLOOKUP(D390,tblFeiertage[Datum],1,0)=D390,\"x\"),\"\")","v":""}]
["",null,{"$f":"IFERROR(VLOOKUP($D390,tblFeiertage[],2,0),\"\")","v":""},null,{"$f":"IFERROR(IF(VLOOKUP(D391,tblFeiertage[Datum],1,0)=D391,\"x\"),\"\")","v":""}]
["",{"$f":"WEEKNUM(C392)","v":29},{"$f":"D392","v":"2019-07-14"},{"$f":"D390+1","v":"2019-07-14"},{"$f":"IFERROR(IF(VLOOKUP(D392,tblFeiertage[Datum],1,0)=D392,\"x\"),\"\")","v":""}]
["",null,{"$f":"IFERROR(VLOOKUP($D392,tblFeiertage[],2,0),\"\")","v":""},null,{"$f":"IFERROR(IF(VLOOKUP(D393,tblFeiertage[Datum],1,0)=D393,\"x\"),\"\")","v":""}]
["",null,{"$f":"D394","v":"2019-07-15"},{"$f":"D392+1","v":"2019-07-15"},{"$f":"IFERROR(IF(VLOOKUP(D394,tblFeiertage[Datum],1,0)=D394,\"x\"),\"\")","v":""}]
["",null,{"$f":"IFERROR(VLOOKUP($D394,tblFeiertage[],2,0),\"\")","v":""},null,{"$f":"IFERROR(IF(VLOOKUP(D395,tblFeiertage[Datum],1,0)=D395,\"x\"),\"\")","v":""}]
["",null,{"$f":"D396","v":"2019-07-16"},{"$f":"D394+1","v":"2019-07-16"},{"$f":"IFERROR(IF(VLOOKUP(D396,tblFeiertage[Datum],1,0)=D396,\"x\"),\"\")","v":""}]
["",null,{"$f":"IFERROR(VLOOKUP($D396,tblFeiertage[],2,0),\"\")","v":""},null,{"$f":"IFERROR(IF(VLOOKUP(D397,tblFeiertage[Datum],1,0)=D397,\"x\"),\"\")","v":""}]
["",null,{"$f":"D398","v":"2019-07-17"},{"$f":"D396+1","v":"2019-07-17"},{"$f":"IFERROR(IF(VLOOKUP(D398,tblFeiertage[Datum],1,0)=D398,\"x\"),\"\")","v":""}]
["",null,{"$f":"IFERROR(VLOOKUP($D398,tblFeiertage[],2,0),\"\")","v":""},null,{"$f":"IFERROR(IF(VLOOKUP(D399,tblFeiertage[Datum],1,0)=D399,\"x\"),\"\")","v":""}]
["",null,{"$f":"D400","v":"2019-07-18"},{"$f":"D398+1","v":"2019-07-18"},{"$f":"IFERROR(IF(VLOOKUP(D400,tblFeiertage[Datum],1,0)=D400,\"x\"),\"\")","v":""}]
["",null,{"$f":"IFERROR(VLOOKUP($D400,tblFeiertage[],2,0),\"\")","v":""},null,{"$f":"IFERROR(IF(VLOOKUP(D401,tblFeiertage[Datum],1,0)=D401,\"x\"),\"\")","v":""}]
["",null,{"$f":"D402","v":"2019-07-19"},{"$f":"D400+1","v":"2019-07-19"},{"$f":"IFERROR(IF(VLOOKUP(D402,tblFeiertage[Datum],1,0)=D402,\"x\"),\"\")","v":""}]
["",null,{"$f":"IFERROR(VLOOKUP($D402,tblFeiertage[],2,0),\"\")","v":""},null,{"$f":"IFERROR(IF(VLOOKUP(D403,tblFeiertage[Datum],1,0)=D403,\"x\"),\"\")","v":""}]
["",null,{"$f":"D404","v":"2019-07-20"},{"$f":"D402+1","v":"2019-07-20"},{"$f":"IFERROR(IF(VLOOKUP(D404,tblFeiertage[Datum],1,0)=D404,\"x\"),\"\")","v":""}]
["",null,{"$f":"IFERROR(VLOOKUP($D404,tblFeiertage[],2,0),\"\")","v":""},null,{"$f":"IFERROR(IF(VLOOKUP(D405,tblFeiertage[Datum],1,0)=D405,\"x\"),\"\")","v":""}]
["",{"$f":"WEEKNUM(C406)","v":30},{"$f":"D406","v":"2019-07-21"},{"$f":"D404+1","v":"2019-07-21"},{"$f":"IFERROR(IF(VLOOKUP(D406,tblFeiertage[Datum],1,0)=D406,\"x\"),\"\")","v":""}]
["",null,{"$f":"IFERROR(VLOOKUP($D406,tblFeiertage[],2,0),\"\")","v":""},null,{"$f":"IFERROR(IF(VLOOKUP(D407,tblFeiertage[Datum],1,0)=D407,\"x\"),\"\")","v":""}]
["",null,{"$f":"D408","v":"2019-07-22"},{"$f":"D406+1","v":"2019-07-22"},{"$f":"IFERROR(IF(VLOOKUP(D408,tblFeiertage[Datum],1,0)=D408,\"x\"),\"\")","v":""}]
["",null,{"$f":"IFERROR(VLOOKUP($D408,tblFeiertage[],2,0),\"\")","v":""},null,{"$f":"IFERROR(IF(VLOOKUP(D409,tblFeiertage[Datum],1,0)=D409,\"x\"),\"\")","v":""}]
["",null,{"$f":"D410","v":"2019-07-23"},{"$f":"D408+1","v":"2019-07-23"},{"$f":"IFERROR(IF(VLOOKUP(D410,tblFeiertage[Datum],1,0)=D410,\"x\"),\"\")","v":""}]
["",null,{"$f":"IFERROR(VLOOKUP($D410,tblFeiertage[],2,0),\"\")","v":""},null,{"$f":"IFERROR(IF(VLOOKUP(D411,tblFeiertage[Datum],1,0)=D411,\"x\"),\"\")","v":""}]
["",null,{"$f":"D412","v":"2019-07-24"},{"$f":"D410+1","v":"2019-07-24"},{"$f":"IFERROR(IF(VLOOKUP(D412,tblFeiertage[Datum],1,0)=D412,\"x\"),\"\")","v":""}]
["",null,{"$f":"IFERROR(VLOOKUP($D412,tblFeiertage[],2,0),\"\")","v":""},null,{"$f":"IFERROR(IF(VLOOKUP(D413,tblFeiertage[Datum],1,0)=D413,\"x\"),\"\")","v":""}]
["",null,{"$f":"D414","v":"2019-07-25"},{"$f":"D412+1","v":"2019-07-25"},{"$f":"IFERROR(IF(VLOOKUP(D414,tblFeiertage[Datum],1,0)=D414,\"x\"),\"\")","v":""}]
["",null,{"$f":"IFERROR(VLOOKUP($D414,tblFeiertage[],2,0),\"\")","v":""},null,{"$f":"IFERROR(IF(VLOOKUP(D415,tblFeiertage[Datum],1,0)=D415,\"x\"),\"\")","v":""}]
["",null,{"$f":"D416","v":"2019-07-26"},{"$f":"D414+1","v":"2019-07-26"},{"$f":"IFERROR(IF(VLOOKUP(D416,tblFeiertage[Datum],1,0)=D416,\"x\"),\"\")","v":""}]
["",null,{"$f":"IFERROR(VLOOKUP($D416,tblFeiertage[],2,0),\"\")","v":""},null,{"$f":"IFERROR(IF(VLOOKUP(D417,tblFeiertage[Datum],1,0)=D417,\"x\"),\"\")","v":""}]
["",null,{"$f":"D418","v":"2019-07-27"},{"$f":"D416+1","v":"2019-07-27"},{"$f":"IFERROR(IF(VLOOKUP(D418,tblFeiertage[Datum],1,0)=D418,\"x\"),\"\")","v":""}]
["",null,{"$f":"IFERROR(VLOOKUP($D418,tblFeiertage[],2,0),\"\")","v":""},null,{"$f":"IFERROR(IF(VLOOKUP(D419,tblFeiertage[Datum],1,0)=D419,\"x\"),\"\")","v":""}]
["",{"$f":"WEEKNUM(C420)","v":31},{"$f":"D420","v":"2019-07-28"},{"$f":"D418+1","v":"2019-07-28"},{"$f":"IFERROR(IF(VLOOKUP(D420,tblFeiertage[Datum],1,0)=D420,\"x\"),\"\")","v":""}]
["",null,{"$f":"IFERROR(VLOOKUP($D420,tblFeiertage[],2,0),\"\")","v":""},null,{"$f":"IFERROR(IF(VLOOKUP(D421,tblFeiertage[Datum],1,0)=D421,\"x\"),\"\")","v":""}]
["",null,{"$f":"D422","v":"2019-07-29"},{"$f":"D420+1","v":"2019-07-29"},{"$f":"IFERROR(IF(VLOOKUP(D422,tblFeiertage[Datum],1,0)=D422,\"x\"),\"\")","v":""}]
["",null,{"$f":"IFERROR(VLOOKUP($D422,tblFeiertage[],2,0),\"\")","v":""},null,{"$f":"IFERROR(IF(VLOOKUP(D423,tblFeiertage[Datum],1,0)=D423,\"x\"),\"\")","v":""}]
["",null,{"$f":"D424","v":"2019-07-30"},{"$f":"D422+1","v":"2019-07-30"},{"$f":"IFERROR(IF(VLOOKUP(D424,tblFeiertage[Datum],1,0)=D424,\"x\"),\"\")","v":""}]
["",null,{"$f":"IFERROR(VLOOKUP($D424,tblFeiertage[],2,0),\"\")","v":""},null,{"$f":"IFERROR(IF(VLOOKUP(D425,tblFeiertage[Datum],1,0)=D425,\"x\"),\"\")","v":""}]
["",null,{"$f":"D426","v":"2019-07-31"},{"$f":"D424+1","v":"2019-07-31"},{"$f":"IFERROR(IF(VLOOKUP(D426,tblFeiertage[Datum],1,0)=D426,\"x\"),\"\")","v":""}]
["",null,{"$f":"IFERROR(VLOOKUP($D426,tblFeiertage[],2,0),\"\")","v":""},null,{"$f":"IFERROR(IF(VLOOKUP(D427,tblFeiertage[Datum],1,0)=D427,\"x\"),\"\")","v":""}]
["2019-08-01",null,{"$f":"D428","v":"2019-08-01"},{"$f":"D426+1","v":"2019-08-01"},{"$f":"IFERROR(IF(VLOOKUP(D428,tblFeiertage[Datum],1,0)=D428,\"x\"),\"\")","v":"x"}]
["",null,{"$f":"IFERROR(VLOOKUP($D428,tblFeiertage[],2,0),\"\")","v":"Nationalfeiertag Schweiz"},null,{"$f":"IFERROR(IF(VLOOKUP(D429,tblFeiertage[Datum],1,0)=D429,\"x\"),\"\")","v":""}]
["",null,{"$f":"D430","v":"2019-08-02"},{"$f":"D428+1","v":"2019-08-02"},{"$f":"IFERROR(IF(VLOOKUP(D430,tblFeiertage[Datum],1,0)=D430,\"x\"),\"\")","v":""}]
["",null,{"$f":"IFERROR(VLOOKUP($D430,tblFeiertage[],2,0),\"\")","v":""},null,{"$f":"IFERROR(IF(VLOOKUP(D431,tblFeiertage[Datum],1,0)=D431,\"x\"),\"\")","v":""}]
["",null,{"$f":"D432","v":"2019-08-03"},{"$f":"D430+1","v":"2019-08-03"},{"$f":"IFERROR(IF(VLOOKUP(D432,tblFeiertage[Datum],1,0)=D432,\"x\"),\"\")","v":""}]
["",null,{"$f":"IFERROR(VLOOKUP($D432,tblFeiertage[],2,0),\"\")","v":""},null,{"$f":"IFERROR(IF(VLOOKUP(D433,tblFeiertage[Datum],1,0)=D433,\"x\"),\"\")","v":""}]
["",{"$f":"WEEKNUM(C434)","v":32},{"$f":"D434","v":"2019-08-04"},{"$f":"D432+1","v":"2019-08-04"},{"$f":"IFERROR(IF(VLOOKUP(D434,tblFeiertage[Datum],1,0)=D434,\"x\"),\"\")","v":""}]
["",null,{"$f":"IFERROR(VLOOKUP($D434,tblFeiertage[],2,0),\"\")","v":""},null,{"$f":"IFERROR(IF(VLOOKUP(D435,tblFeiertage[Datum],1,0)=D435,\"x\"),\"\")","v":""}]
["",null,{"$f":"D436","v":"2019-08-05"},{"$f":"D434+1","v":"2019-08-05"},{"$f":"IFERROR(IF(VLOOKUP(D436,tblFeiertage[Datum],1,0)=D436,\"x\"),\"\")","v":""}]
["",null,{"$f":"IFERROR(VLOOKUP($D436,tblFeiertage[],2,0),\"\")","v":""},null,{"$f":"IFERROR(IF(VLOOKUP(D437,tblFeiertage[Datum],1,0)=D437,\"x\"),\"\")","v":""}]
["",null,{"$f":"D438","v":"2019-08-06"},{"$f":"D436+1","v":"2019-08-06"},{"$f":"IFERROR(IF(VLOOKUP(D438,tblFeiertage[Datum],1,0)=D438,\"x\"),\"\")","v":""}]
["",null,{"$f":"IFERROR(VLOOKUP($D438,tblFeiertage[],2,0),\"\")","v":""},null,{"$f":"IFERROR(IF(VLOOKUP(D439,tblFeiertage[Datum],1,0)=D439,\"x\"),\"\")","v":""}]
["",null,{"$f":"D440","v":"2019-08-07"},{"$f":"D438+1","v":"2019-08-07"},{"$f":"IFERROR(IF(VLOOKUP(D440,tblFeiertage[Datum],1,0)=D440,\"x\"),\"\")","v":""}]
["",null,{"$f":"IFERROR(VLOOKUP($D440,tblFeiertage[],2,0),\"\")","v":""},null,{"$f":"IFERROR(IF(VLOOKUP(D441,tblFeiertage[Datum],1,0)=D441,\"x\"),\"\")","v":""}]
["",null,{"$f":"D442","v":"2019-08-08"},{"$f":"D440+1","v":"2019-08-08"},{"$f":"IFERROR(IF(VLOOKUP(D442,tblFeiertage[Datum],1,0)=D442,\"x\"),\"\")","v":""}]
["",null,{"$f":"IFERROR(VLOOKUP($D442,tblFeiertage[],2,0),\"\")","v":""},null,{"$f":"IFERROR(IF(VLOOKUP(D443,tblFeiertage[Datum],1,0)=D443,\"x\"),\"\")","v":""}]
["",null,{"$f":"D444","v":"2019-08-09"},{"$f":"D442+1","v":"2019-08-09"},{"$f":"IFERROR(IF(VLOOKUP(D444,tblFeiertage[Datum],1,0)=D444,\"x\"),\"\")","v":""}]
["",null,{"$f":"IFERROR(VLOOKUP($D444,tblFeiertage[],2,0),\"\")","v":""},null,{"$f":"IFERROR(IF(VLOOKUP(D445,tblFeiertage[Datum],1,0)=D445,\"x\"),\"\")","v":""}]
["",null,{"$f":"D446","v":"2019-08-10"},{"$f":"D444+1","v":"2019-08-10"},{"$f":"IFERROR(IF(VLOOKUP(D446,tblFeiertage[Datum],1,0)=D446,\"x\"),\"\")","v":""}]
["",null,{"$f":"IFERROR(VLOOKUP($D446,tblFeiertage[],2,0),\"\")","v":""},null,{"$f":"IFERROR(IF(VLOOKUP(D447,tblFeiertage[Datum],1,0)=D447,\"x\"),\"\")","v":""}]
["",{"$f":"WEEKNUM(C448)","v":33},{"$f":"D448","v":"2019-08-11"},{"$f":"D446+1","v":"2019-08-11"},{"$f":"IFERROR(IF(VLOOKUP(D448,tblFeiertage[Datum],1,0)=D448,\"x\"),\"\")","v":""}]
["",null,{"$f":"IFERROR(VLOOKUP($D448,tblFeiertage[],2,0),\"\")","v":""},null,{"$f":"IFERROR(IF(VLOOKUP(D449,tblFeiertage[Datum],1,0)=D449,\"x\"),\"\")","v":""}]
["",null,{"$f":"D450","v":"2019-08-12"},{"$f":"D448+1","v":"2019-08-12"},{"$f":"IFERROR(IF(VLOOKUP(D450,tblFeiertage[Datum],1,0)=D450,\"x\"),\"\")","v":""}]
[{"$f":"IF(DAY(D451)=1,D451,\"\")","v":""},null,{"$f":"IFERROR(VLOOKUP($D450,tblFeiertage[],2,0),\"\")","v":""},null,{"$f":"IFERROR(IF(VLOOKUP(D451,tblFeiertage[Datum],1,0)=D451,\"x\"),\"\")","v":""}]
["",null,{"$f":"D452","v":"2019-08-13"},{"$f":"D450+1","v":"2019-08-13"},{"$f":"IFERROR(IF(VLOOKUP(D452,tblFeiertage[Datum],1,0)=D452,\"x\"),\"\")","v":""}]
["",null,{"$f":"IFERROR(VLOOKUP($D452,tblFeiertage[],2,0),\"\")","v":""},null,{"$f":"IFERROR(IF(VLOOKUP(D453,tblFeiertage[Datum],1,0)=D453,\"x\"),\"\")","v":""}]
["",null,{"$f":"D454","v":"2019-08-14"},{"$f":"D452+1","v":"2019-08-14"},{"$f":"IFERROR(IF(VLOOKUP(D454,tblFeiertage[Datum],1,0)=D454,\"x\"),\"\")","v":""}]
["",null,{"$f":"IFERROR(VLOOKUP($D454,tblFeiertage[],2,0),\"\")","v":""},null,{"$f":"IFERROR(IF(VLOOKUP(D455,tblFeiertage[Datum],1,0)=D455,\"x\"),\"\")","v":""}]
["",null,{"$f":"D456","v":"2019-08-15"},{"$f":"D454+1","v":"2019-08-15"},{"$f":"IFERROR(IF(VLOOKUP(D456,tblFeiertage[Datum],1,0)=D456,\"x\"),\"\")","v":""}]
["",null,{"$f":"IFERROR(VLOOKUP($D456,tblFeiertage[],2,0),\"\")","v":""},null,{"$f":"IFERROR(IF(VLOOKUP(D457,tblFeiertage[Datum],1,0)=D457,\"x\"),\"\")","v":""}]
["",null,{"$f":"D458","v":"2019-08-16"},{"$f":"D456+1","v":"2019-08-16"},{"$f":"IFERROR(IF(VLOOKUP(D458,tblFeiertage[Datum],1,0)=D458,\"x\"),\"\")","v":""}]
["",null,{"$f":"IFERROR(VLOOKUP($D458,tblFeiertage[],2,0),\"\")","v":""},null,{"$f":"IFERROR(IF(VLOOKUP(D459,tblFeiertage[Datum],1,0)=D459,\"x\"),\"\")","v":""}]
["",null,{"$f":"D460","v":"2019-08-17"},{"$f":"D458+1","v":"2019-08-17"},{"$f":"IFERROR(IF(VLOOKUP(D460,tblFeiertage[Datum],1,0)=D460,\"x\"),\"\")","v":""}]
["",null,{"$f":"IFERROR(VLOOKUP($D460,tblFeiertage[],2,0),\"\")","v":""},null,{"$f":"IFERROR(IF(VLOOKUP(D461,tblFeiertage[Datum],1,0)=D461,\"x\"),\"\")","v":""}]
["",{"$f":"WEEKNUM(C462)","v":34},{"$f":"D462","v":"2019-08-18"},{"$f":"D460+1","v":"2019-08-18"},{"$f":"IFERROR(IF(VLOOKUP(D462,tblFeiertage[Datum],1,0)=D462,\"x\"),\"\")","v":""}]
["",null,{"$f":"IFERROR(VLOOKUP($D462,tblFeiertage[],2,0),\"\")","v":""},null,{"$f":"IFERROR(IF(VLOOKUP(D463,tblFeiertage[Datum],1,0)=D463,\"x\"),\"\")","v":""}]
["",null,{"$f":"D464","v":"2019-08-19"},{"$f":"D462+1","v":"2019-08-19"},{"$f":"IFERROR(IF(VLOOKUP(D464,tblFeiertage[Datum],1,0)=D464,\"x\"),\"\")","v":""}]
["",null,{"$f":"IFERROR(VLOOKUP($D464,tblFeiertage[],2,0),\"\")","v":""},null,{"$f":"IFERROR(IF(VLOOKUP(D465,tblFeiertage[Datum],1,0)=D465,\"x\"),\"\")","v":""}]
["",null,{"$f":"D466","v":"2019-08-20"},{"$f":"D464+1","v":"2019-08-20"},{"$f":"IFERROR(IF(VLOOKUP(D466,tblFeiertage[Datum],1,0)=D466,\"x\"),\"\")","v":""}]
["",null,{"$f":"IFERROR(VLOOKUP($D466,tblFeiertage[],2,0),\"\")","v":""},null,{"$f":"IFERROR(IF(VLOOKUP(D467,tblFeiertage[Datum],1,0)=D467,\"x\"),\"\")","v":""}]
["",null,{"$f":"D468","v":"2019-08-21"},{"$f":"D466+1","v":"2019-08-21"},{"$f":"IFERROR(IF(VLOOKUP(D468,tblFeiertage[Datum],1,0)=D468,\"x\"),\"\")","v":""}]
["",null,{"$f":"IFERROR(VLOOKUP($D468,tblFeiertage[],2,0),\"\")","v":""},null,{"$f":"IFERROR(IF(VLOOKUP(D469,tblFeiertage[Datum],1,0)=D469,\"x\"),\"\")","v":""}]
["",null,{"$f":"D470","v":"2019-08-22"},{"$f":"D468+1","v":"2019-08-22"},{"$f":"IFERROR(IF(VLOOKUP(D470,tblFeiertage[Datum],1,0)=D470,\"x\"),\"\")","v":""}]
["",null,{"$f":"IFERROR(VLOOKUP($D470,tblFeiertage[],2,0),\"\")","v":""},null,{"$f":"IFERROR(IF(VLOOKUP(D471,tblFeiertage[Datum],1,0)=D471,\"x\"),\"\")","v":""}]
["",null,{"$f":"D472","v":"2019-08-23"},{"$f":"D470+1","v":"2019-08-23"},{"$f":"IFERROR(IF(VLOOKUP(D472,tblFeiertage[Datum],1,0)=D472,\"x\"),\"\")","v":""}]
["",null,{"$f":"IFERROR(VLOOKUP($D472,tblFeiertage[],2,0),\"\")","v":""},null,{"$f":"IFERROR(IF(VLOOKUP(D473,tblFeiertage[Datum],1,0)=D473,\"x\"),\"\")","v":""}]
["",null,{"$f":"D474","v":"2019-08-24"},{"$f":"D472+1","v":"2019-08-24"},{"$f":"IFERROR(IF(VLOOKUP(D474,tblFeiertage[Datum],1,0)=D474,\"x\"),\"\")","v":""}]
["",null,{"$f":"IFERROR(VLOOKUP($D474,tblFeiertage[],2,0),\"\")","v":""},null,{"$f":"IFERROR(IF(VLOOKUP(D475,tblFeiertage[Datum],1,0)=D475,\"x\"),\"\")","v":""}]
["",{"$f":"WEEKNUM(C476)","v":35},{"$f":"D476","v":"2019-08-25"},{"$f":"D474+1","v":"2019-08-25"},{"$f":"IFERROR(IF(VLOOKUP(D476,tblFeiertage[Datum],1,0)=D476,\"x\"),\"\")","v":""}]
["",null,{"$f":"IFERROR(VLOOKUP($D476,tblFeiertage[],2,0),\"\")","v":""},null,{"$f":"IFERROR(IF(VLOOKUP(D477,tblFeiertage[Datum],1,0)=D477,\"x\"),\"\")","v":""}]
["",null,{"$f":"D478","v":"2019-08-26"},{"$f":"D476+1","v":"2019-08-26"},{"$f":"IFERROR(IF(VLOOKUP(D478,tblFeiertage[Datum],1,0)=D478,\"x\"),\"\")","v":""}]
["",null,{"$f":"IFERROR(VLOOKUP($D478,tblFeiertage[],2,0),\"\")","v":""},null,{"$f":"IFERROR(IF(VLOOKUP(D479,tblFeiertage[Datum],1,0)=D479,\"x\"),\"\")","v":""}]
["",null,{"$f":"D480","v":"2019-08-27"},{"$f":"D478+1","v":"2019-08-27"},{"$f":"IFERROR(IF(VLOOKUP(D480,tblFeiertage[Datum],1,0)=D480,\"x\"),\"\")","v":""}]
["",null,{"$f":"IFERROR(VLOOKUP($D480,tblFeiertage[],2,0),\"\")","v":""},null,{"$f":"IFERROR(IF(VLOOKUP(D481,tblFeiertage[Datum],1,0)=D481,\"x\"),\"\")","v":""}]
["",null,{"$f":"D482","v":"2019-08-28"},{"$f":"D480+1","v":"2019-08-28"},{"$f":"IFERROR(IF(VLOOKUP(D482,tblFeiertage[Datum],1,0)=D482,\"x\"),\"\")","v":""}]
["",null,{"$f":"IFERROR(VLOOKUP($D482,tblFeiertage[],2,0),\"\")","v":""},null,{"$f":"IFERROR(IF(VLOOKUP(D483,tblFeiertage[Datum],1,0)=D483,\"x\"),\"\")","v":""}]
["",null,{"$f":"D484","v":"2019-08-29"},{"$f":"D482+1","v":"2019-08-29"},{"$f":"IFERROR(IF(VLOOKUP(D484,tblFeiertage[Datum],1,0)=D484,\"x\"),\"\")","v":""}]
["",null,{"$f":"IFERROR(VLOOKUP($D484,tblFeiertage[],2,0),\"\")","v":""},null,{"$f":"IFERROR(IF(VLOOKUP(D485,tblFeiertage[Datum],1,0)=D485,\"x\"),\"\")","v":""}]
["",null,{"$f":"D486","v":"2019-08-30"},{"$f":"D484+1","v":"2019-08-30"},{"$f":"IFERROR(IF(VLOOKUP(D486,tblFeiertage[Datum],1,0)=D486,\"x\"),\"\")","v":""}]
["",null,{"$f":"IFERROR(VLOOKUP($D486,tblFeiertage[],2,0),\"\")","v":""},null,{"$f":"IFERROR(IF(VLOOKUP(D487,tblFeiertage[Datum],1,0)=D487,\"x\"),\"\")","v":""}]
["",null,{"$f":"D488","v":"2019-08-31"},{"$f":"D486+1","v":"2019-08-31"},{"$f":"IFERROR(IF(VLOOKUP(D488,tblFeiertage[Datum],1,0)=D488,\"x\"),\"\")","v":""}]
["",null,{"$f":"IFERROR(VLOOKUP($D488,tblFeiertage[],2,0),\"\")","v":""},null,{"$f":"IFERROR(IF(VLOOKUP(D489,tblFeiertage[Datum],1,0)=D489,\"x\"),\"\")","v":""}]
["2019-09-01",{"$f":"WEEKNUM(C490)","v":36},{"$f":"D490","v":"2019-09-01"},{"$f":"D488+1","v":"2019-09-01"},{"$f":"IFERROR(IF(VLOOKUP(D490,tblFeiertage[Datum],1,0)=D490,\"x\"),\"\")","v":""}]
["",null,{"$f":"IFERROR(VLOOKUP($D490,tblFeiertage[],2,0),\"\")","v":""},null,{"$f":"IFERROR(IF(VLOOKUP(D491,tblFeiertage[Datum],1,0)=D491,\"x\"),\"\")","v":""}]
["",null,{"$f":"D492","v":"2019-09-02"},{"$f":"D490+1","v":"2019-09-02"},{"$f":"IFERROR(IF(VLOOKUP(D492,tblFeiertage[Datum],1,0)=D492,\"x\"),\"\")","v":""},"Urlaub - Genehmigt",null,null,null,null,"Urlaub - Beantragt"]
["",null,{"$f":"IFERROR(VLOOKUP($D492,tblFeiertage[],2,0),\"\")","v":""},null,{"$f":"IFERROR(IF(VLOOKUP(D493,tblFeiertage[Datum],1,0)=D493,\"x\"),\"\")","v":""},"Urlaub - Genehmigt",null,null,null,null,"Urlaub - Beantragt"]
["",null,{"$f":"D494","v":"2019-09-03"},{"$f":"D492+1","v":"2019-09-03"},{"$f":"IFERROR(IF(VLOOKUP(D494,tblFeiertage[Datum],1,0)=D494,\"x\"),\"\")","v":""},"Urlaub - Genehmigt"]
["",null,{"$f":"IFERROR(VLOOKUP($D494,tblFeiertage[],2,0),\"\")","v":""},null,{"$f":"IFERROR(IF(VLOOKUP(D495,tblFeiertage[Datum],1,0)=D495,\"x\"),\"\")","v":""},"Urlaub - Genehmigt",null,"Kurse / Weiterbildung"]
["",null,{"$f":"D496","v":"2019-09-04"},{"$f":"D494+1","v":"2019-09-04"},{"$f":"IFERROR(IF(VLOOKUP(D496,tblFeiertage[Datum],1,0)=D496,\"x\"),\"\")","v":""},"Urlaub - Genehmigt",null,"Kurse / Weiterbildung"]
["",null,{"$f":"IFERROR(VLOOKUP($D496,tblFeiertage[],2,0),\"\")","v":""},null,{"$f":"IFERROR(IF(VLOOKUP(D497,tblFeiertage[Datum],1,0)=D497,\"x\"),\"\")","v":""},"Urlaub - Genehmigt",null,"Kurse / Weiterbildung"]
["",null,{"$f":"D498","v":"2019-09-05"},{"$f":"D496+1","v":"2019-09-05"},{"$f":"IFERROR(IF(VLOOKUP(D498,tblFeiertage[Datum],1,0)=D498,\"x\"),\"\")","v":""},"Urlaub - Genehmigt",null,"Kurse / Weiterbildung"]
["",null,{"$f":"IFERROR(VLOOKUP($D498,tblFeiertage[],2,0),\"\")","v":""},null,{"$f":"IFERROR(IF(VLOOKUP(D499,tblFeiertage[Datum],1,0)=D499,\"x\"),\"\")","v":""},"Urlaub - Genehmigt"]
["",null,{"$f":"D500","v":"2019-09-06"},{"$f":"D498+1","v":"2019-09-06"},{"$f":"IFERROR(IF(VLOOKUP(D500,tblFeiertage[Datum],1,0)=D500,\"x\"),\"\")","v":""},"Urlaub - Genehmigt"]
["",null,{"$f":"IFERROR(VLOOKUP($D500,tblFeiertage[],2,0),\"\")","v":""},null,{"$f":"IFERROR(IF(VLOOKUP(D501,tblFeiertage[Datum],1,0)=D501,\"x\"),\"\")","v":""},"Urlaub - Genehmigt"]
["",null,{"$f":"D502","v":"2019-09-07"},{"$f":"D500+1","v":"2019-09-07"},{"$f":"IFERROR(IF(VLOOKUP(D502,tblFeiertage[Datum],1,0)=D502,\"x\"),\"\")","v":""}]
["",null,{"$f":"IFERROR(VLOOKUP($D502,tblFeiertage[],2,0),\"\")","v":""},null,{"$f":"IFERROR(IF(VLOOKUP(D503,tblFeiertage[Datum],1,0)=D503,\"x\"),\"\")","v":""}]
["",{"$f":"WEEKNUM(C504)","v":37},{"$f":"D504","v":"2019-09-08"},{"$f":"D502+1","v":"2019-09-08"},{"$f":"IFERROR(IF(VLOOKUP(D504,tblFeiertage[Datum],1,0)=D504,\"x\"),\"\")","v":""}]
["",null,{"$f":"IFERROR(VLOOKUP($D504,tblFeiertage[],2,0),\"\")","v":""},null,{"$f":"IFERROR(IF(VLOOKUP(D505,tblFeiertage[Datum],1,0)=D505,\"x\"),\"\")","v":""}]
["",null,{"$f":"D506","v":"2019-09-09"},{"$f":"D504+1","v":"2019-09-09"},{"$f":"IFERROR(IF(VLOOKUP(D506,tblFeiertage[Datum],1,0)=D506,\"x\"),\"\")","v":""}]
["",null,{"$f":"IFERROR(VLOOKUP($D506,tblFeiertage[],2,0),\"\")","v":""},null,{"$f":"IFERROR(IF(VLOOKUP(D507,tblFeiertage[Datum],1,0)=D507,\"x\"),\"\")","v":""},null,null,null,null,"Militär / Zivildienst"]
["",null,{"$f":"D508","v":"2019-09-10"},{"$f":"D506+1","v":"2019-09-10"},{"$f":"IFERROR(IF(VLOOKUP(D508,tblFeiertage[Datum],1,0)=D508,\"x\"),\"\")","v":""},null,null,null,null,"Militär / Zivildienst"]
["",null,{"$f":"IFERROR(VLOOKUP($D508,tblFeiertage[],2,0),\"\")","v":""},null,{"$f":"IFERROR(IF(VLOOKUP(D509,tblFeiertage[Datum],1,0)=D509,\"x\"),\"\")","v":""},null,null,null,null,"Militär / Zivildienst"]
["",null,{"$f":"D510","v":"2019-09-11"},{"$f":"D508+1","v":"2019-09-11"},{"$f":"IFERROR(IF(VLOOKUP(D510,tblFeiertage[Datum],1,0)=D510,\"x\"),\"\")","v":""}]
["",null,{"$f":"IFERROR(VLOOKUP($D510,tblFeiertage[],2,0),\"\")","v":""},null,{"$f":"IFERROR(IF(VLOOKUP(D511,tblFeiertage[Datum],1,0)=D511,\"x\"),\"\")","v":""}]
["",null,{"$f":"D512","v":"2019-09-12"},{"$f":"D510+1","v":"2019-09-12"},{"$f":"IFERROR(IF(VLOOKUP(D512,tblFeiertage[Datum],1,0)=D512,\"x\"),\"\")","v":""}]
["",null,{"$f":"IFERROR(VLOOKUP($D512,tblFeiertage[],2,0),\"\")","v":""},null,{"$f":"IFERROR(IF(VLOOKUP(D513,tblFeiertage[Datum],1,0)=D513,\"x\"),\"\")","v":""}]
["",null,{"$f":"D514","v":"2019-09-13"},{"$f":"D512+1","v":"2019-09-13"},{"$f":"IFERROR(IF(VLOOKUP(D514,tblFeiertage[Datum],1,0)=D514,\"x\"),\"\")","v":""}]
[{"$f":"IF(DAY(D515)=1,D515,\"\")","v":""},null,{"$f":"IFERROR(VLOOKUP($D514,tblFeiertage[],2,0),\"\")","v":""},null,{"$f":"IFERROR(IF(VLOOKUP(D515,tblFeiertage[Datum],1,0)=D515,\"x\"),\"\")","v":""}]
["",null,{"$f":"D516","v":"2019-09-14"},{"$f":"D514+1","v":"2019-09-14"},{"$f":"IFERROR(IF(VLOOKUP(D516,tblFeiertage[Datum],1,0)=D516,\"x\"),\"\")","v":""}]
["",null,{"$f":"IFERROR(VLOOKUP($D516,tblFeiertage[],2,0),\"\")","v":""},null,{"$f":"IFERROR(IF(VLOOKUP(D517,tblFeiertage[Datum],1,0)=D517,\"x\"),\"\")","v":""}]
["",{"$f":"WEEKNUM(C518)","v":38},{"$f":"D518","v":"2019-09-15"},{"$f":"D516+1","v":"2019-09-15"},{"$f":"IFERROR(IF(VLOOKUP(D518,tblFeiertage[Datum],1,0)=D518,\"x\"),\"\")","v":""}]
["",null,{"$f":"IFERROR(VLOOKUP($D518,tblFeiertage[],2,0),\"\")","v":""},null,{"$f":"IFERROR(IF(VLOOKUP(D519,tblFeiertage[Datum],1,0)=D519,\"x\"),\"\")","v":""}]
["",null,{"$f":"D520","v":"2019-09-16"},{"$f":"D518+1","v":"2019-09-16"},{"$f":"IFERROR(IF(VLOOKUP(D520,tblFeiertage[Datum],1,0)=D520,\"x\"),\"\")","v":""}]
["",null,{"$f":"IFERROR(VLOOKUP($D520,tblFeiertage[],2,0),\"\")","v":""},null,{"$f":"IFERROR(IF(VLOOKUP(D521,tblFeiertage[Datum],1,0)=D521,\"x\"),\"\")","v":""}]
["",null,{"$f":"D522","v":"2019-09-17"},{"$f":"D520+1","v":"2019-09-17"},{"$f":"IFERROR(IF(VLOOKUP(D522,tblFeiertage[Datum],1,0)=D522,\"x\"),\"\")","v":""}]
["",null,{"$f":"IFERROR(VLOOKUP($D522,tblFeiertage[],2,0),\"\")","v":""},null,{"$f":"IFERROR(IF(VLOOKUP(D523,tblFeiertage[Datum],1,0)=D523,\"x\"),\"\")","v":""}]
["",null,{"$f":"D524","v":"2019-09-18"},{"$f":"D522+1","v":"2019-09-18"},{"$f":"IFERROR(IF(VLOOKUP(D524,tblFeiertage[Datum],1,0)=D524,\"x\"),\"\")","v":""}]
["",null,{"$f":"IFERROR(VLOOKUP($D524,tblFeiertage[],2,0),\"\")","v":""},null,{"$f":"IFERROR(IF(VLOOKUP(D525,tblFeiertage[Datum],1,0)=D525,\"x\"),\"\")","v":""}]
["",null,{"$f":"D526","v":"2019-09-19"},{"$f":"D524+1","v":"2019-09-19"},{"$f":"IFERROR(IF(VLOOKUP(D526,tblFeiertage[Datum],1,0)=D526,\"x\"),\"\")","v":""}]
["",null,{"$f":"IFERROR(VLOOKUP($D526,tblFeiertage[],2,0),\"\")","v":""},null,{"$f":"IFERROR(IF(VLOOKUP(D527,tblFeiertage[Datum],1,0)=D527,\"x\"),\"\")","v":""}]
["",null,{"$f":"D528","v":"2019-09-20"},{"$f":"D526+1","v":"2019-09-20"},{"$f":"IFERROR(IF(VLOOKUP(D528,tblFeiertage[Datum],1,0)=D528,\"x\"),\"\")","v":""}]
["",null,{"$f":"IFERROR(VLOOKUP($D528,tblFeiertage[],2,0),\"\")","v":""},null,{"$f":"IFERROR(IF(VLOOKUP(D529,tblFeiertage[Datum],1,0)=D529,\"x\"),\"\")","v":""}]
["",null,{"$f":"D530","v":"2019-09-21"},{"$f":"D528+1","v":"2019-09-21"},{"$f":"IFERROR(IF(VLOOKUP(D530,tblFeiertage[Datum],1,0)=D530,\"x\"),\"\")","v":""}]
["",null,{"$f":"IFERROR(VLOOKUP($D530,tblFeiertage[],2,0),\"\")","v":""},null,{"$f":"IFERROR(IF(VLOOKUP(D531,tblFeiertage[Datum],1,0)=D531,\"x\"),\"\")","v":""}]
["",{"$f":"WEEKNUM(C532)","v":39},{"$f":"D532","v":"2019-09-22"},{"$f":"D530+1","v":"2019-09-22"},{"$f":"IFERROR(IF(VLOOKUP(D532,tblFeiertage[Datum],1,0)=D532,\"x\"),\"\")","v":""}]
["",null,{"$f":"IFERROR(VLOOKUP($D532,tblFeiertage[],2,0),\"\")","v":""},null,{"$f":"IFERROR(IF(VLOOKUP(D533,tblFeiertage[Datum],1,0)=D533,\"x\"),\"\")","v":""}]
["",null,{"$f":"D534","v":"2019-09-23"},{"$f":"D532+1","v":"2019-09-23"},{"$f":"IFERROR(IF(VLOOKUP(D534,tblFeiertage[Datum],1,0)=D534,\"x\"),\"\")","v":""}]
["",null,{"$f":"IFERROR(VLOOKUP($D534,tblFeiertage[],2,0),\"\")","v":""},null,{"$f":"IFERROR(IF(VLOOKUP(D535,tblFeiertage[Datum],1,0)=D535,\"x\"),\"\")","v":""}]
["",null,{"$f":"D536","v":"2019-09-24"},{"$f":"D534+1","v":"2019-09-24"},{"$f":"IFERROR(IF(VLOOKUP(D536,tblFeiertage[Datum],1,0)=D536,\"x\"),\"\")","v":""}]
["",null,{"$f":"IFERROR(VLOOKUP($D536,tblFeiertage[],2,0),\"\")","v":""},null,{"$f":"IFERROR(IF(VLOOKUP(D537,tblFeiertage[Datum],1,0)=D537,\"x\"),\"\")","v":""}]
["",null,{"$f":"D538","v":"2019-09-25"},{"$f":"D536+1","v":"2019-09-25"},{"$f":"IFERROR(IF(VLOOKUP(D538,tblFeiertage[Datum],1,0)=D538,\"x\"),\"\")","v":""}]
["",null,{"$f":"IFERROR(VLOOKUP($D538,tblFeiertage[],2,0),\"\")","v":""},null,{"$f":"IFERROR(IF(VLOOKUP(D539,tblFeiertage[Datum],1,0)=D539,\"x\"),\"\")","v":""}]
["",null,{"$f":"D540","v":"2019-09-26"},{"$f":"D538+1","v":"2019-09-26"},{"$f":"IFERROR(IF(VLOOKUP(D540,tblFeiertage[Datum],1,0)=D540,\"x\"),\"\")","v":""}]
["",null,{"$f":"IFERROR(VLOOKUP($D540,tblFeiertage[],2,0),\"\")","v":""},null,{"$f":"IFERROR(IF(VLOOKUP(D541,tblFeiertage[Datum],1,0)=D541,\"x\"),\"\")","v":""}]
["",null,{"$f":"D542","v":"2019-09-27"},{"$f":"D540+1","v":"2019-09-27"},{"$f":"IFERROR(IF(VLOOKUP(D542,tblFeiertage[Datum],1,0)=D542,\"x\"),\"\")","v":""}]
["",null,{"$f":"IFERROR(VLOOKUP($D542,tblFeiertage[],2,0),\"\")","v":""},null,{"$f":"IFERROR(IF(VLOOKUP(D543,tblFeiertage[Datum],1,0)=D543,\"x\"),\"\")","v":""}]
["",null,{"$f":"D544","v":"2019-09-28"},{"$f":"D542+1","v":"2019-09-28"},{"$f":"IFERROR(IF(VLOOKUP(D544,tblFeiertage[Datum],1,0)=D544,\"x\"),\"\")","v":""}]
["",null,{"$f":"IFERROR(VLOOKUP($D544,tblFeiertage[],2,0),\"\")","v":""},null,{"$f":"IFERROR(IF(VLOOKUP(D545,tblFeiertage[Datum],1,0)=D545,\"x\"),\"\")","v":""}]
["",{"$f":"WEEKNUM(C546)","v":40},{"$f":"D546","v":"2019-09-29"},{"$f":"D544+1","v":"2019-09-29"},{"$f":"IFERROR(IF(VLOOKUP(D546,tblFeiertage[Datum],1,0)=D546,\"x\"),\"\")","v":""}]
["",null,{"$f":"IFERROR(VLOOKUP($D546,tblFeiertage[],2,0),\"\")","v":""},null,{"$f":"IFERROR(IF(VLOOKUP(D547,tblFeiertage[Datum],1,0)=D547,\"x\"),\"\")","v":""}]
["",null,{"$f":"D548","v":"2019-09-30"},{"$f":"D546+1","v":"2019-09-30"},{"$f":"IFERROR(IF(VLOOKUP(D548,tblFeiertage[Datum],1,0)=D548,\"x\"),\"\")","v":""}]
["",null,{"$f":"IFERROR(VLOOKUP($D548,tblFeiertage[],2,0),\"\")","v":""},null,{"$f":"IFERROR(IF(VLOOKUP(D549,tblFeiertage[Datum],1,0)=D549,\"x\"),\"\")","v":""}]
["2019-10-01",null,{"$f":"D550","v":"2019-10-01"},{"$f":"D548+1","v":"2019-10-01"},{"$f":"IFERROR(IF(VLOOKUP(D550,tblFeiertage[Datum],1,0)=D550,\"x\"),\"\")","v":""}]
["",null,{"$f":"IFERROR(VLOOKUP($D550,tblFeiertage[],2,0),\"\")","v":""},null,{"$f":"IFERROR(IF(VLOOKUP(D551,tblFeiertage[Datum],1,0)=D551,\"x\"),\"\")","v":""}]
["",null,{"$f":"D552","v":"2019-10-02"},{"$f":"D550+1","v":"2019-10-02"},{"$f":"IFERROR(IF(VLOOKUP(D552,tblFeiertage[Datum],1,0)=D552,\"x\"),\"\")","v":""}]
["",null,{"$f":"IFERROR(VLOOKUP($D552,tblFeiertage[],2,0),\"\")","v":""},null,{"$f":"IFERROR(IF(VLOOKUP(D553,tblFeiertage[Datum],1,0)=D553,\"x\"),\"\")","v":""}]
["",null,{"$f":"D554","v":"2019-10-03"},{"$f":"D552+1","v":"2019-10-03"},{"$f":"IFERROR(IF(VLOOKUP(D554,tblFeiertage[Datum],1,0)=D554,\"x\"),\"\")","v":"x"}]
["",null,{"$f":"IFERROR(VLOOKUP($D554,tblFeiertage[],2,0),\"\")","v":"Tag der Deutschen Einheit"},null,{"$f":"IFERROR(IF(VLOOKUP(D555,tblFeiertage[Datum],1,0)=D555,\"x\"),\"\")","v":""}]
["",null,{"$f":"D556","v":"2019-10-04"},{"$f":"D554+1","v":"2019-10-04"},{"$f":"IFERROR(IF(VLOOKUP(D556,tblFeiertage[Datum],1,0)=D556,\"x\"),\"\")","v":""}]
["",null,{"$f":"IFERROR(VLOOKUP($D556,tblFeiertage[],2,0),\"\")","v":""},null,{"$f":"IFERROR(IF(VLOOKUP(D557,tblFeiertage[Datum],1,0)=D557,\"x\"),\"\")","v":""}]
["",null,{"$f":"D558","v":"2019-10-05"},{"$f":"D556+1","v":"2019-10-05"},{"$f":"IFERROR(IF(VLOOKUP(D558,tblFeiertage[Datum],1,0)=D558,\"x\"),\"\")","v":""}]
["",null,{"$f":"IFERROR(VLOOKUP($D558,tblFeiertage[],2,0),\"\")","v":""},null,{"$f":"IFERROR(IF(VLOOKUP(D559,tblFeiertage[Datum],1,0)=D559,\"x\"),\"\")","v":""}]
["",{"$f":"WEEKNUM(C560)","v":41},{"$f":"D560","v":"2019-10-06"},{"$f":"D558+1","v":"2019-10-06"},{"$f":"IFERROR(IF(VLOOKUP(D560,tblFeiertage[Datum],1,0)=D560,\"x\"),\"\")","v":""}]
["",null,{"$f":"IFERROR(VLOOKUP($D560,tblFeiertage[],2,0),\"\")","v":""},null,{"$f":"IFERROR(IF(VLOOKUP(D561,tblFeiertage[Datum],1,0)=D561,\"x\"),\"\")","v":""}]
["",null,{"$f":"D562","v":"2019-10-07"},{"$f":"D560+1","v":"2019-10-07"},{"$f":"IFERROR(IF(VLOOKUP(D562,tblFeiertage[Datum],1,0)=D562,\"x\"),\"\")","v":""}]
["",null,{"$f":"IFERROR(VLOOKUP($D562,tblFeiertage[],2,0),\"\")","v":""},null,{"$f":"IFERROR(IF(VLOOKUP(D563,tblFeiertage[Datum],1,0)=D563,\"x\"),\"\")","v":""}]
["",null,{"$f":"D564","v":"2019-10-08"},{"$f":"D562+1","v":"2019-10-08"},{"$f":"IFERROR(IF(VLOOKUP(D564,tblFeiertage[Datum],1,0)=D564,\"x\"),\"\")","v":""}]
["",null,{"$f":"IFERROR(VLOOKUP($D564,tblFeiertage[],2,0),\"\")","v":""},null,{"$f":"IFERROR(IF(VLOOKUP(D565,tblFeiertage[Datum],1,0)=D565,\"x\"),\"\")","v":""}]
["",null,{"$f":"D566","v":"2019-10-09"},{"$f":"D564+1","v":"2019-10-09"},{"$f":"IFERROR(IF(VLOOKUP(D566,tblFeiertage[Datum],1,0)=D566,\"x\"),\"\")","v":""}]
["",null,{"$f":"IFERROR(VLOOKUP($D566,tblFeiertage[],2,0),\"\")","v":""},null,{"$f":"IFERROR(IF(VLOOKUP(D567,tblFeiertage[Datum],1,0)=D567,\"x\"),\"\")","v":""}]
["",null,{"$f":"D568","v":"2019-10-10"},{"$f":"D566+1","v":"2019-10-10"},{"$f":"IFERROR(IF(VLOOKUP(D568,tblFeiertage[Datum],1,0)=D568,\"x\"),\"\")","v":""}]
["",null,{"$f":"IFERROR(VLOOKUP($D568,tblFeiertage[],2,0),\"\")","v":""},null,{"$f":"IFERROR(IF(VLOOKUP(D569,tblFeiertage[Datum],1,0)=D569,\"x\"),\"\")","v":""}]
["",null,{"$f":"D570","v":"2019-10-11"},{"$f":"D568+1","v":"2019-10-11"},{"$f":"IFERROR(IF(VLOOKUP(D570,tblFeiertage[Datum],1,0)=D570,\"x\"),\"\")","v":""}]
["",null,{"$f":"IFERROR(VLOOKUP($D570,tblFeiertage[],2,0),\"\")","v":""},null,{"$f":"IFERROR(IF(VLOOKUP(D571,tblFeiertage[Datum],1,0)=D571,\"x\"),\"\")","v":""}]
["",null,{"$f":"D572","v":"2019-10-12"},{"$f":"D570+1","v":"2019-10-12"},{"$f":"IFERROR(IF(VLOOKUP(D572,tblFeiertage[Datum],1,0)=D572,\"x\"),\"\")","v":""}]
["",null,{"$f":"IFERROR(VLOOKUP($D572,tblFeiertage[],2,0),\"\")","v":""},null,{"$f":"IFERROR(IF(VLOOKUP(D573,tblFeiertage[Datum],1,0)=D573,\"x\"),\"\")","v":""}]
["",{"$f":"WEEKNUM(C574)","v":42},{"$f":"D574","v":"2019-10-13"},{"$f":"D572+1","v":"2019-10-13"},{"$f":"IFERROR(IF(VLOOKUP(D574,tblFeiertage[Datum],1,0)=D574,\"x\"),\"\")","v":""}]
["",null,{"$f":"IFERROR(VLOOKUP($D574,tblFeiertage[],2,0),\"\")","v":""},null,{"$f":"IFERROR(IF(VLOOKUP(D575,tblFeiertage[Datum],1,0)=D575,\"x\"),\"\")","v":""}]
["",null,{"$f":"D576","v":"2019-10-14"},{"$f":"D574+1","v":"2019-10-14"},{"$f":"IFERROR(IF(VLOOKUP(D576,tblFeiertage[Datum],1,0)=D576,\"x\"),\"\")","v":""}]
["",null,{"$f":"IFERROR(VLOOKUP($D576,tblFeiertage[],2,0),\"\")","v":""},null,{"$f":"IFERROR(IF(VLOOKUP(D577,tblFeiertage[Datum],1,0)=D577,\"x\"),\"\")","v":""}]
["",null,{"$f":"D578","v":"2019-10-15"},{"$f":"D576+1","v":"2019-10-15"},{"$f":"IFERROR(IF(VLOOKUP(D578,tblFeiertage[Datum],1,0)=D578,\"x\"),\"\")","v":""}]
[{"$f":"IF(DAY(D579)=1,D579,\"\")","v":""},null,{"$f":"IFERROR(VLOOKUP($D578,tblFeiertage[],2,0),\"\")","v":""},null,{"$f":"IFERROR(IF(VLOOKUP(D579,tblFeiertage[Datum],1,0)=D579,\"x\"),\"\")","v":""}]
["",null,{"$f":"D580","v":"2019-10-16"},{"$f":"D578+1","v":"2019-10-16"},{"$f":"IFERROR(IF(VLOOKUP(D580,tblFeiertage[Datum],1,0)=D580,\"x\"),\"\")","v":""}]
["",null,{"$f":"IFERROR(VLOOKUP($D580,tblFeiertage[],2,0),\"\")","v":""},null,{"$f":"IFERROR(IF(VLOOKUP(D581,tblFeiertage[Datum],1,0)=D581,\"x\"),\"\")","v":""}]
["",null,{"$f":"D582","v":"2019-10-17"},{"$f":"D580+1","v":"2019-10-17"},{"$f":"IFERROR(IF(VLOOKUP(D582,tblFeiertage[Datum],1,0)=D582,\"x\"),\"\")","v":""}]
["",null,{"$f":"IFERROR(VLOOKUP($D582,tblFeiertage[],2,0),\"\")","v":""},null,{"$f":"IFERROR(IF(VLOOKUP(D583,tblFeiertage[Datum],1,0)=D583,\"x\"),\"\")","v":""}]
["",null,{"$f":"D584","v":"2019-10-18"},{"$f":"D582+1","v":"2019-10-18"},{"$f":"IFERROR(IF(VLOOKUP(D584,tblFeiertage[Datum],1,0)=D584,\"x\"),\"\")","v":""}]
["",null,{"$f":"IFERROR(VLOOKUP($D584,tblFeiertage[],2,0),\"\")","v":""},null,{"$f":"IFERROR(IF(VLOOKUP(D585,tblFeiertage[Datum],1,0)=D585,\"x\"),\"\")","v":""}]
["",null,{"$f":"D586","v":"2019-10-19"},{"$f":"D584+1","v":"2019-10-19"},{"$f":"IFERROR(IF(VLOOKUP(D586,tblFeiertage[Datum],1,0)=D586,\"x\"),\"\")","v":""}]
["",null,{"$f":"IFERROR(VLOOKUP($D586,tblFeiertage[],2,0),\"\")","v":""},null,{"$f":"IFERROR(IF(VLOOKUP(D587,tblFeiertage[Datum],1,0)=D587,\"x\"),\"\")","v":""}]
["",{"$f":"WEEKNUM(C588)","v":43},{"$f":"D588","v":"2019-10-20"},{"$f":"D586+1","v":"2019-10-20"},{"$f":"IFERROR(IF(VLOOKUP(D588,tblFeiertage[Datum],1,0)=D588,\"x\"),\"\")","v":""}]
["",null,{"$f":"IFERROR(VLOOKUP($D588,tblFeiertage[],2,0),\"\")","v":""},null,{"$f":"IFERROR(IF(VLOOKUP(D589,tblFeiertage[Datum],1,0)=D589,\"x\"),\"\")","v":""}]
["",null,{"$f":"D590","v":"2019-10-21"},{"$f":"D588+1","v":"2019-10-21"},{"$f":"IFERROR(IF(VLOOKUP(D590,tblFeiertage[Datum],1,0)=D590,\"x\"),\"\")","v":""}]
["",null,{"$f":"IFERROR(VLOOKUP($D590,tblFeiertage[],2,0),\"\")","v":""},null,{"$f":"IFERROR(IF(VLOOKUP(D591,tblFeiertage[Datum],1,0)=D591,\"x\"),\"\")","v":""}]
["",null,{"$f":"D592","v":"2019-10-22"},{"$f":"D590+1","v":"2019-10-22"},{"$f":"IFERROR(IF(VLOOKUP(D592,tblFeiertage[Datum],1,0)=D592,\"x\"),\"\")","v":""}]
["",null,{"$f":"IFERROR(VLOOKUP($D592,tblFeiertage[],2,0),\"\")","v":""},null,{"$f":"IFERROR(IF(VLOOKUP(D593,tblFeiertage[Datum],1,0)=D593,\"x\"),\"\")","v":""}]
["",null,{"$f":"D594","v":"2019-10-23"},{"$f":"D592+1","v":"2019-10-23"},{"$f":"IFERROR(IF(VLOOKUP(D594,tblFeiertage[Datum],1,0)=D594,\"x\"),\"\")","v":""}]
["",null,{"$f":"IFERROR(VLOOKUP($D594,tblFeiertage[],2,0),\"\")","v":""},null,{"$f":"IFERROR(IF(VLOOKUP(D595,tblFeiertage[Datum],1,0)=D595,\"x\"),\"\")","v":""}]
["",null,{"$f":"D596","v":"2019-10-24"},{"$f":"D594+1","v":"2019-10-24"},{"$f":"IFERROR(IF(VLOOKUP(D596,tblFeiertage[Datum],1,0)=D596,\"x\"),\"\")","v":""}]
["",null,{"$f":"IFERROR(VLOOKUP($D596,tblFeiertage[],2,0),\"\")","v":""},null,{"$f":"IFERROR(IF(VLOOKUP(D597,tblFeiertage[Datum],1,0)=D597,\"x\"),\"\")","v":""}]
["",null,{"$f":"D598","v":"2019-10-25"},{"$f":"D596+1","v":"2019-10-25"},{"$f":"IFERROR(IF(VLOOKUP(D598,tblFeiertage[Datum],1,0)=D598,\"x\"),\"\")","v":""}]
["",null,{"$f":"IFERROR(VLOOKUP($D598,tblFeiertage[],2,0),\"\")","v":""},null,{"$f":"IFERROR(IF(VLOOKUP(D599,tblFeiertage[Datum],1,0)=D599,\"x\"),\"\")","v":""}]
["",null,{"$f":"D600","v":"2019-10-26"},{"$f":"D598+1","v":"2019-10-26"},{"$f":"IFERROR(IF(VLOOKUP(D600,tblFeiertage[Datum],1,0)=D600,\"x\"),\"\")","v":""}]
["",null,{"$f":"IFERROR(VLOOKUP($D600,tblFeiertage[],2,0),\"\")","v":""},null,{"$f":"IFERROR(IF(VLOOKUP(D601,tblFeiertage[Datum],1,0)=D601,\"x\"),\"\")","v":""}]
["",{"$f":"WEEKNUM(C602)","v":44},{"$f":"D602","v":"2019-10-27"},{"$f":"D600+1","v":"2019-10-27"},{"$f":"IFERROR(IF(VLOOKUP(D602,tblFeiertage[Datum],1,0)=D602,\"x\"),\"\")","v":""}]
["",null,{"$f":"IFERROR(VLOOKUP($D602,tblFeiertage[],2,0),\"\")","v":""},null,{"$f":"IFERROR(IF(VLOOKUP(D603,tblFeiertage[Datum],1,0)=D603,\"x\"),\"\")","v":""}]
["",null,{"$f":"D604","v":"2019-10-28"},{"$f":"D602+1","v":"2019-10-28"},{"$f":"IFERROR(IF(VLOOKUP(D604,tblFeiertage[Datum],1,0)=D604,\"x\"),\"\")","v":""}]
["",null,{"$f":"IFERROR(VLOOKUP($D604,tblFeiertage[],2,0),\"\")","v":""},null,{"$f":"IFERROR(IF(VLOOKUP(D605,tblFeiertage[Datum],1,0)=D605,\"x\"),\"\")","v":""}]
["",null,{"$f":"D606","v":"2019-10-29"},{"$f":"D604+1","v":"2019-10-29"},{"$f":"IFERROR(IF(VLOOKUP(D606,tblFeiertage[Datum],1,0)=D606,\"x\"),\"\")","v":""}]
["",null,{"$f":"IFERROR(VLOOKUP($D606,tblFeiertage[],2,0),\"\")","v":""},null,{"$f":"IFERROR(IF(VLOOKUP(D607,tblFeiertage[Datum],1,0)=D607,\"x\"),\"\")","v":""}]
["",null,{"$f":"D608","v":"2019-10-30"},{"$f":"D606+1","v":"2019-10-30"},{"$f":"IFERROR(IF(VLOOKUP(D608,tblFeiertage[Datum],1,0)=D608,\"x\"),\"\")","v":""}]
["",null,{"$f":"IFERROR(VLOOKUP($D608,tblFeiertage[],2,0),\"\")","v":""},null,{"$f":"IFERROR(IF(VLOOKUP(D609,tblFeiertage[Datum],1,0)=D609,\"x\"),\"\")","v":""}]
["",null,{"$f":"D610","v":"2019-10-31"},{"$f":"D608+1","v":"2019-10-31"},{"$f":"IFERROR(IF(VLOOKUP(D610,tblFeiertage[Datum],1,0)=D610,\"x\"),\"\")","v":""}]
["",null,{"$f":"IFERROR(VLOOKUP($D610,tblFeiertage[],2,0),\"\")","v":""},null,{"$f":"IFERROR(IF(VLOOKUP(D611,tblFeiertage[Datum],1,0)=D611,\"x\"),\"\")","v":""}]
["2019-11-01",null,{"$f":"D612","v":"2019-11-01"},{"$f":"D610+1","v":"2019-11-01"},{"$f":"IFERROR(IF(VLOOKUP(D612,tblFeiertage[Datum],1,0)=D612,\"x\"),\"\")","v":""}]
["",null,{"$f":"IFERROR(VLOOKUP($D612,tblFeiertage[],2,0),\"\")","v":""},null,{"$f":"IFERROR(IF(VLOOKUP(D613,tblFeiertage[Datum],1,0)=D613,\"x\"),\"\")","v":""}]
["",null,{"$f":"D614","v":"2019-11-02"},{"$f":"D612+1","v":"2019-11-02"},{"$f":"IFERROR(IF(VLOOKUP(D614,tblFeiertage[Datum],1,0)=D614,\"x\"),\"\")","v":""}]
["",null,{"$f":"IFERROR(VLOOKUP($D614,tblFeiertage[],2,0),\"\")","v":""},null,{"$f":"IFERROR(IF(VLOOKUP(D615,tblFeiertage[Datum],1,0)=D615,\"x\"),\"\")","v":""}]
["",{"$f":"WEEKNUM(C616)","v":45},{"$f":"D616","v":"2019-11-03"},{"$f":"D614+1","v":"2019-11-03"},{"$f":"IFERROR(IF(VLOOKUP(D616,tblFeiertage[Datum],1,0)=D616,\"x\"),\"\")","v":""}]
["",null,{"$f":"IFERROR(VLOOKUP($D616,tblFeiertage[],2,0),\"\")","v":""},null,{"$f":"IFERROR(IF(VLOOKUP(D617,tblFeiertage[Datum],1,0)=D617,\"x\"),\"\")","v":""}]
["",null,{"$f":"D618","v":"2019-11-04"},{"$f":"D616+1","v":"2019-11-04"},{"$f":"IFERROR(IF(VLOOKUP(D618,tblFeiertage[Datum],1,0)=D618,\"x\"),\"\")","v":""}]
["",null,{"$f":"IFERROR(VLOOKUP($D618,tblFeiertage[],2,0),\"\")","v":""},null,{"$f":"IFERROR(IF(VLOOKUP(D619,tblFeiertage[Datum],1,0)=D619,\"x\"),\"\")","v":""}]
["",null,{"$f":"D620","v":"2019-11-05"},{"$f":"D618+1","v":"2019-11-05"},{"$f":"IFERROR(IF(VLOOKUP(D620,tblFeiertage[Datum],1,0)=D620,\"x\"),\"\")","v":""}]
["",null,{"$f":"IFERROR(VLOOKUP($D620,tblFeiertage[],2,0),\"\")","v":""},null,{"$f":"IFERROR(IF(VLOOKUP(D621,tblFeiertage[Datum],1,0)=D621,\"x\"),\"\")","v":""}]
["",null,{"$f":"D622","v":"2019-11-06"},{"$f":"D620+1","v":"2019-11-06"},{"$f":"IFERROR(IF(VLOOKUP(D622,tblFeiertage[Datum],1,0)=D622,\"x\"),\"\")","v":""}]
["",null,{"$f":"IFERROR(VLOOKUP($D622,tblFeiertage[],2,0),\"\")","v":""},null,{"$f":"IFERROR(IF(VLOOKUP(D623,tblFeiertage[Datum],1,0)=D623,\"x\"),\"\")","v":""}]
["",null,{"$f":"D624","v":"2019-11-07"},{"$f":"D622+1","v":"2019-11-07"},{"$f":"IFERROR(IF(VLOOKUP(D624,tblFeiertage[Datum],1,0)=D624,\"x\"),\"\")","v":""}]
["",null,{"$f":"IFERROR(VLOOKUP($D624,tblFeiertage[],2,0),\"\")","v":""},null,{"$f":"IFERROR(IF(VLOOKUP(D625,tblFeiertage[Datum],1,0)=D625,\"x\"),\"\")","v":""}]
["",null,{"$f":"D626","v":"2019-11-08"},{"$f":"D624+1","v":"2019-11-08"},{"$f":"IFERROR(IF(VLOOKUP(D626,tblFeiertage[Datum],1,0)=D626,\"x\"),\"\")","v":""}]
["",null,{"$f":"IFERROR(VLOOKUP($D626,tblFeiertage[],2,0),\"\")","v":""},null,{"$f":"IFERROR(IF(VLOOKUP(D627,tblFeiertage[Datum],1,0)=D627,\"x\"),\"\")","v":""}]
["",null,{"$f":"D628","v":"2019-11-09"},{"$f":"D626+1","v":"2019-11-09"},{"$f":"IFERROR(IF(VLOOKUP(D628,tblFeiertage[Datum],1,0)=D628,\"x\"),\"\")","v":""}]
["",null,{"$f":"IFERROR(VLOOKUP($D628,tblFeiertage[],2,0),\"\")","v":""},null,{"$f":"IFERROR(IF(VLOOKUP(D629,tblFeiertage[Datum],1,0)=D629,\"x\"),\"\")","v":""}]
["",{"$f":"WEEKNUM(C630)","v":46},{"$f":"D630","v":"2019-11-10"},{"$f":"D628+1","v":"2019-11-10"},{"$f":"IFERROR(IF(VLOOKUP(D630,tblFeiertage[Datum],1,0)=D630,\"x\"),\"\")","v":""}]
["",null,{"$f":"IFERROR(VLOOKUP($D630,tblFeiertage[],2,0),\"\")","v":""},null,{"$f":"IFERROR(IF(VLOOKUP(D631,tblFeiertage[Datum],1,0)=D631,\"x\"),\"\")","v":""}]
["",null,{"$f":"D632","v":"2019-11-11"},{"$f":"D630+1","v":"2019-11-11"},{"$f":"IFERROR(IF(VLOOKUP(D632,tblFeiertage[Datum],1,0)=D632,\"x\"),\"\")","v":""}]
["",null,{"$f":"IFERROR(VLOOKUP($D632,tblFeiertage[],2,0),\"\")","v":""},null,{"$f":"IFERROR(IF(VLOOKUP(D633,tblFeiertage[Datum],1,0)=D633,\"x\"),\"\")","v":""}]
["",null,{"$f":"D634","v":"2019-11-12"},{"$f":"D632+1","v":"2019-11-12"},{"$f":"IFERROR(IF(VLOOKUP(D634,tblFeiertage[Datum],1,0)=D634,\"x\"),\"\")","v":""}]
["",null,{"$f":"IFERROR(VLOOKUP($D634,tblFeiertage[],2,0),\"\")","v":""},null,{"$f":"IFERROR(IF(VLOOKUP(D635,tblFeiertage[Datum],1,0)=D635,\"x\"),\"\")","v":""}]
["",null,{"$f":"D636","v":"2019-11-13"},{"$f":"D634+1","v":"2019-11-13"},{"$f":"IFERROR(IF(VLOOKUP(D636,tblFeiertage[Datum],1,0)=D636,\"x\"),\"\")","v":""}]
["",null,{"$f":"IFERROR(VLOOKUP($D636,tblFeiertage[],2,0),\"\")","v":""},null,{"$f":"IFERROR(IF(VLOOKUP(D637,tblFeiertage[Datum],1,0)=D637,\"x\"),\"\")","v":""}]
["",null,{"$f":"D638","v":"2019-11-14"},{"$f":"D636+1","v":"2019-11-14"},{"$f":"IFERROR(IF(VLOOKUP(D638,tblFeiertage[Datum],1,0)=D638,\"x\"),\"\")","v":""}]
["",null,{"$f":"IFERROR(VLOOKUP($D638,tblFeiertage[],2,0),\"\")","v":""},null,{"$f":"IFERROR(IF(VLOOKUP(D639,tblFeiertage[Datum],1,0)=D639,\"x\"),\"\")","v":""}]
["",null,{"$f":"D640","v":"2019-11-15"},{"$f":"D638+1","v":"2019-11-15"},{"$f":"IFERROR(IF(VLOOKUP(D640,tblFeiertage[Datum],1,0)=D640,\"x\"),\"\")","v":""}]
["",null,{"$f":"IFERROR(VLOOKUP($D640,tblFeiertage[],2,0),\"\")","v":""},null,{"$f":"IFERROR(IF(VLOOKUP(D641,tblFeiertage[Datum],1,0)=D641,\"x\"),\"\")","v":""}]
["",null,{"$f":"D642","v":"2019-11-16"},{"$f":"D640+1","v":"2019-11-16"},{"$f":"IFERROR(IF(VLOOKUP(D642,tblFeiertage[Datum],1,0)=D642,\"x\"),\"\")","v":""}]
[{"$f":"IF(DAY(D643)=1,D643,\"\")","v":""},null,{"$f":"IFERROR(VLOOKUP($D642,tblFeiertage[],2,0),\"\")","v":""},null,{"$f":"IFERROR(IF(VLOOKUP(D643,tblFeiertage[Datum],1,0)=D643,\"x\"),\"\")","v":""}]
["",{"$f":"WEEKNUM(C644)","v":47},{"$f":"D644","v":"2019-11-17"},{"$f":"D642+1","v":"2019-11-17"},{"$f":"IFERROR(IF(VLOOKUP(D644,tblFeiertage[Datum],1,0)=D644,\"x\"),\"\")","v":""}]
["",null,{"$f":"IFERROR(VLOOKUP($D644,tblFeiertage[],2,0),\"\")","v":""},null,{"$f":"IFERROR(IF(VLOOKUP(D645,tblFeiertage[Datum],1,0)=D645,\"x\"),\"\")","v":""}]
["",null,{"$f":"D646","v":"2019-11-18"},{"$f":"D644+1","v":"2019-11-18"},{"$f":"IFERROR(IF(VLOOKUP(D646,tblFeiertage[Datum],1,0)=D646,\"x\"),\"\")","v":""}]
["",null,{"$f":"IFERROR(VLOOKUP($D646,tblFeiertage[],2,0),\"\")","v":""},null,{"$f":"IFERROR(IF(VLOOKUP(D647,tblFeiertage[Datum],1,0)=D647,\"x\"),\"\")","v":""}]
["",null,{"$f":"D648","v":"2019-11-19"},{"$f":"D646+1","v":"2019-11-19"},{"$f":"IFERROR(IF(VLOOKUP(D648,tblFeiertage[Datum],1,0)=D648,\"x\"),\"\")","v":""}]
["",null,{"$f":"IFERROR(VLOOKUP($D648,tblFeiertage[],2,0),\"\")","v":""},null,{"$f":"IFERROR(IF(VLOOKUP(D649,tblFeiertage[Datum],1,0)=D649,\"x\"),\"\")","v":""}]
["",null,{"$f":"D650","v":"2019-11-20"},{"$f":"D648+1","v":"2019-11-20"},{"$f":"IFERROR(IF(VLOOKUP(D650,tblFeiertage[Datum],1,0)=D650,\"x\"),\"\")","v":""}]
["",null,{"$f":"IFERROR(VLOOKUP($D650,tblFeiertage[],2,0),\"\")","v":""},null,{"$f":"IFERROR(IF(VLOOKUP(D651,tblFeiertage[Datum],1,0)=D651,\"x\"),\"\")","v":""}]
["",null,{"$f":"D652","v":"2019-11-21"},{"$f":"D650+1","v":"2019-11-21"},{"$f":"IFERROR(IF(VLOOKUP(D652,tblFeiertage[Datum],1,0)=D652,\"x\"),\"\")","v":""}]
["",null,{"$f":"IFERROR(VLOOKUP($D652,tblFeiertage[],2,0),\"\")","v":""},null,{"$f":"IFERROR(IF(VLOOKUP(D653,tblFeiertage[Datum],1,0)=D653,\"x\"),\"\")","v":""}]
["",null,{"$f":"D654","v":"2019-11-22"},{"$f":"D652+1","v":"2019-11-22"},{"$f":"IFERROR(IF(VLOOKUP(D654,tblFeiertage[Datum],1,0)=D654,\"x\"),\"\")","v":""}]
["",null,{"$f":"IFERROR(VLOOKUP($D654,tblFeiertage[],2,0),\"\")","v":""},null,{"$f":"IFERROR(IF(VLOOKUP(D655,tblFeiertage[Datum],1,0)=D655,\"x\"),\"\")","v":""}]
["",null,{"$f":"D656","v":"2019-11-23"},{"$f":"D654+1","v":"2019-11-23"},{"$f":"IFERROR(IF(VLOOKUP(D656,tblFeiertage[Datum],1,0)=D656,\"x\"),\"\")","v":""}]
["",null,{"$f":"IFERROR(VLOOKUP($D656,tblFeiertage[],2,0),\"\")","v":""},null,{"$f":"IFERROR(IF(VLOOKUP(D657,tblFeiertage[Datum],1,0)=D657,\"x\"),\"\")","v":""}]
["",{"$f":"WEEKNUM(C658)","v":48},{"$f":"D658","v":"2019-11-24"},{"$f":"D656+1","v":"2019-11-24"},{"$f":"IFERROR(IF(VLOOKUP(D658,tblFeiertage[Datum],1,0)=D658,\"x\"),\"\")","v":""}]
["",null,{"$f":"IFERROR(VLOOKUP($D658,tblFeiertage[],2,0),\"\")","v":""},null,{"$f":"IFERROR(IF(VLOOKUP(D659,tblFeiertage[Datum],1,0)=D659,\"x\"),\"\")","v":""}]
["",null,{"$f":"D660","v":"2019-11-25"},{"$f":"D658+1","v":"2019-11-25"},{"$f":"IFERROR(IF(VLOOKUP(D660,tblFeiertage[Datum],1,0)=D660,\"x\"),\"\")","v":""}]
["",null,{"$f":"IFERROR(VLOOKUP($D660,tblFeiertage[],2,0),\"\")","v":""},null,{"$f":"IFERROR(IF(VLOOKUP(D661,tblFeiertage[Datum],1,0)=D661,\"x\"),\"\")","v":""}]
["",null,{"$f":"D662","v":"2019-11-26"},{"$f":"D660+1","v":"2019-11-26"},{"$f":"IFERROR(IF(VLOOKUP(D662,tblFeiertage[Datum],1,0)=D662,\"x\"),\"\")","v":""}]
["",null,{"$f":"IFERROR(VLOOKUP($D662,tblFeiertage[],2,0),\"\")","v":""},null,{"$f":"IFERROR(IF(VLOOKUP(D663,tblFeiertage[Datum],1,0)=D663,\"x\"),\"\")","v":""}]
["",null,{"$f":"D664","v":"2019-11-27"},{"$f":"D662+1","v":"2019-11-27"},{"$f":"IFERROR(IF(VLOOKUP(D664,tblFeiertage[Datum],1,0)=D664,\"x\"),\"\")","v":""}]
["",null,{"$f":"IFERROR(VLOOKUP($D664,tblFeiertage[],2,0),\"\")","v":""},null,{"$f":"IFERROR(IF(VLOOKUP(D665,tblFeiertage[Datum],1,0)=D665,\"x\"),\"\")","v":""}]
["",null,{"$f":"D666","v":"2019-11-28"},{"$f":"D664+1","v":"2019-11-28"},{"$f":"IFERROR(IF(VLOOKUP(D666,tblFeiertage[Datum],1,0)=D666,\"x\"),\"\")","v":""}]
["",null,{"$f":"IFERROR(VLOOKUP($D666,tblFeiertage[],2,0),\"\")","v":""},null,{"$f":"IFERROR(IF(VLOOKUP(D667,tblFeiertage[Datum],1,0)=D667,\"x\"),\"\")","v":""}]
["",null,{"$f":"D668","v":"2019-11-29"},{"$f":"D666+1","v":"2019-11-29"},{"$f":"IFERROR(IF(VLOOKUP(D668,tblFeiertage[Datum],1,0)=D668,\"x\"),\"\")","v":""}]
["",null,{"$f":"IFERROR(VLOOKUP($D668,tblFeiertage[],2,0),\"\")","v":""},null,{"$f":"IFERROR(IF(VLOOKUP(D669,tblFeiertage[Datum],1,0)=D669,\"x\"),\"\")","v":""}]
["",null,{"$f":"D670","v":"2019-11-30"},{"$f":"D668+1","v":"2019-11-30"},{"$f":"IFERROR(IF(VLOOKUP(D670,tblFeiertage[Datum],1,0)=D670,\"x\"),\"\")","v":""}]
["",null,{"$f":"IFERROR(VLOOKUP($D670,tblFeiertage[],2,0),\"\")","v":""},null,{"$f":"IFERROR(IF(VLOOKUP(D671,tblFeiertage[Datum],1,0)=D671,\"x\"),\"\")","v":""}]
["2019-12-01",{"$f":"WEEKNUM(C672)","v":49},{"$f":"D672","v":"2019-12-01"},{"$f":"D670+1","v":"2019-12-01"},{"$f":"IFERROR(IF(VLOOKUP(D672,tblFeiertage[Datum],1,0)=D672,\"x\"),\"\")","v":""}]
["",null,{"$f":"IFERROR(VLOOKUP($D672,tblFeiertage[],2,0),\"\")","v":""},null,{"$f":"IFERROR(IF(VLOOKUP(D673,tblFeiertage[Datum],1,0)=D673,\"x\"),\"\")","v":""}]
["",null,{"$f":"D674","v":"2019-12-02"},{"$f":"D672+1","v":"2019-12-02"},{"$f":"IFERROR(IF(VLOOKUP(D674,tblFeiertage[Datum],1,0)=D674,\"x\"),\"\")","v":""}]
["",null,{"$f":"IFERROR(VLOOKUP($D674,tblFeiertage[],2,0),\"\")","v":""},null,{"$f":"IFERROR(IF(VLOOKUP(D675,tblFeiertage[Datum],1,0)=D675,\"x\"),\"\")","v":""}]
["",null,{"$f":"D676","v":"2019-12-03"},{"$f":"D674+1","v":"2019-12-03"},{"$f":"IFERROR(IF(VLOOKUP(D676,tblFeiertage[Datum],1,0)=D676,\"x\"),\"\")","v":""}]
["",null,{"$f":"IFERROR(VLOOKUP($D676,tblFeiertage[],2,0),\"\")","v":""},null,{"$f":"IFERROR(IF(VLOOKUP(D677,tblFeiertage[Datum],1,0)=D677,\"x\"),\"\")","v":""}]
["",null,{"$f":"D678","v":"2019-12-04"},{"$f":"D676+1","v":"2019-12-04"},{"$f":"IFERROR(IF(VLOOKUP(D678,tblFeiertage[Datum],1,0)=D678,\"x\"),\"\")","v":""}]
["",null,{"$f":"IFERROR(VLOOKUP($D678,tblFeiertage[],2,0),\"\")","v":""},null,{"$f":"IFERROR(IF(VLOOKUP(D679,tblFeiertage[Datum],1,0)=D679,\"x\"),\"\")","v":""}]
["",null,{"$f":"D680","v":"2019-12-05"},{"$f":"D678+1","v":"2019-12-05"},{"$f":"IFERROR(IF(VLOOKUP(D680,tblFeiertage[Datum],1,0)=D680,\"x\"),\"\")","v":""}]
["",null,{"$f":"IFERROR(VLOOKUP($D680,tblFeiertage[],2,0),\"\")","v":""},null,{"$f":"IFERROR(IF(VLOOKUP(D681,tblFeiertage[Datum],1,0)=D681,\"x\"),\"\")","v":""}]
["",null,{"$f":"D682","v":"2019-12-06"},{"$f":"D680+1","v":"2019-12-06"},{"$f":"IFERROR(IF(VLOOKUP(D682,tblFeiertage[Datum],1,0)=D682,\"x\"),\"\")","v":""}]
["",null,{"$f":"IFERROR(VLOOKUP($D682,tblFeiertage[],2,0),\"\")","v":""},null,{"$f":"IFERROR(IF(VLOOKUP(D683,tblFeiertage[Datum],1,0)=D683,\"x\"),\"\")","v":""}]
["",null,{"$f":"D684","v":"2019-12-07"},{"$f":"D682+1","v":"2019-12-07"},{"$f":"IFERROR(IF(VLOOKUP(D684,tblFeiertage[Datum],1,0)=D684,\"x\"),\"\")","v":""}]
["",null,{"$f":"IFERROR(VLOOKUP($D684,tblFeiertage[],2,0),\"\")","v":""},null,{"$f":"IFERROR(IF(VLOOKUP(D685,tblFeiertage[Datum],1,0)=D685,\"x\"),\"\")","v":""}]
["",{"$f":"WEEKNUM(C686)","v":50},{"$f":"D686","v":"2019-12-08"},{"$f":"D684+1","v":"2019-12-08"},{"$f":"IFERROR(IF(VLOOKUP(D686,tblFeiertage[Datum],1,0)=D686,\"x\"),\"\")","v":""}]
["",null,{"$f":"IFERROR(VLOOKUP($D686,tblFeiertage[],2,0),\"\")","v":""},null,{"$f":"IFERROR(IF(VLOOKUP(D687,tblFeiertage[Datum],1,0)=D687,\"x\"),\"\")","v":""}]
["",null,{"$f":"D688","v":"2019-12-09"},{"$f":"D686+1","v":"2019-12-09"},{"$f":"IFERROR(IF(VLOOKUP(D688,tblFeiertage[Datum],1,0)=D688,\"x\"),\"\")","v":""}]
["",null,{"$f":"IFERROR(VLOOKUP($D688,tblFeiertage[],2,0),\"\")","v":""},null,{"$f":"IFERROR(IF(VLOOKUP(D689,tblFeiertage[Datum],1,0)=D689,\"x\"),\"\")","v":""}]
["",null,{"$f":"D690","v":"2019-12-10"},{"$f":"D688+1","v":"2019-12-10"},{"$f":"IFERROR(IF(VLOOKUP(D690,tblFeiertage[Datum],1,0)=D690,\"x\"),\"\")","v":""}]
["",null,{"$f":"IFERROR(VLOOKUP($D690,tblFeiertage[],2,0),\"\")","v":""},null,{"$f":"IFERROR(IF(VLOOKUP(D691,tblFeiertage[Datum],1,0)=D691,\"x\"),\"\")","v":""}]
["",null,{"$f":"D692","v":"2019-12-11"},{"$f":"D690+1","v":"2019-12-11"},{"$f":"IFERROR(IF(VLOOKUP(D692,tblFeiertage[Datum],1,0)=D692,\"x\"),\"\")","v":""}]
["",null,{"$f":"IFERROR(VLOOKUP($D692,tblFeiertage[],2,0),\"\")","v":""},null,{"$f":"IFERROR(IF(VLOOKUP(D693,tblFeiertage[Datum],1,0)=D693,\"x\"),\"\")","v":""}]
["",null,{"$f":"D694","v":"2019-12-12"},{"$f":"D692+1","v":"2019-12-12"},{"$f":"IFERROR(IF(VLOOKUP(D694,tblFeiertage[Datum],1,0)=D694,\"x\"),\"\")","v":""}]
["",null,{"$f":"IFERROR(VLOOKUP($D694,tblFeiertage[],2,0),\"\")","v":""},null,{"$f":"IFERROR(IF(VLOOKUP(D695,tblFeiertage[Datum],1,0)=D695,\"x\"),\"\")","v":""}]
["",null,{"$f":"D696","v":"2019-12-13"},{"$f":"D694+1","v":"2019-12-13"},{"$f":"IFERROR(IF(VLOOKUP(D696,tblFeiertage[Datum],1,0)=D696,\"x\"),\"\")","v":""}]
["",null,{"$f":"IFERROR(VLOOKUP($D696,tblFeiertage[],2,0),\"\")","v":""},null,{"$f":"IFERROR(IF(VLOOKUP(D697,tblFeiertage[Datum],1,0)=D697,\"x\"),\"\")","v":""}]
["",null,{"$f":"D698","v":"2019-12-14"},{"$f":"D696+1","v":"2019-12-14"},{"$f":"IFERROR(IF(VLOOKUP(D698,tblFeiertage[Datum],1,0)=D698,\"x\"),\"\")","v":""}]
["",null,{"$f":"IFERROR(VLOOKUP($D698,tblFeiertage[],2,0),\"\")","v":""},null,{"$f":"IFERROR(IF(VLOOKUP(D699,tblFeiertage[Datum],1,0)=D699,\"x\"),\"\")","v":""}]
["",{"$f":"WEEKNUM(C700)","v":51},{"$f":"D700","v":"2019-12-15"},{"$f":"D698+1","v":"2019-12-15"},{"$f":"IFERROR(IF(VLOOKUP(D700,tblFeiertage[Datum],1,0)=D700,\"x\"),\"\")","v":""}]
["",null,{"$f":"IFERROR(VLOOKUP($D700,tblFeiertage[],2,0),\"\")","v":""},null,{"$f":"IFERROR(IF(VLOOKUP(D701,tblFeiertage[Datum],1,0)=D701,\"x\"),\"\")","v":""}]
["",null,{"$f":"D702","v":"2019-12-16"},{"$f":"D700+1","v":"2019-12-16"},{"$f":"IFERROR(IF(VLOOKUP(D702,tblFeiertage[Datum],1,0)=D702,\"x\"),\"\")","v":""}]
["",null,{"$f":"IFERROR(VLOOKUP($D702,tblFeiertage[],2,0),\"\")","v":""},null,{"$f":"IFERROR(IF(VLOOKUP(D703,tblFeiertage[Datum],1,0)=D703,\"x\"),\"\")","v":""}]
["",null,{"$f":"D704","v":"2019-12-17"},{"$f":"D702+1","v":"2019-12-17"},{"$f":"IFERROR(IF(VLOOKUP(D704,tblFeiertage[Datum],1,0)=D704,\"x\"),\"\")","v":""}]
["",null,{"$f":"IFERROR(VLOOKUP($D704,tblFeiertage[],2,0),\"\")","v":""},null,{"$f":"IFERROR(IF(VLOOKUP(D705,tblFeiertage[Datum],1,0)=D705,\"x\"),\"\")","v":""}]
["",null,{"$f":"D706","v":"2019-12-18"},{"$f":"D704+1","v":"2019-12-18"},{"$f":"IFERROR(IF(VLOOKUP(D706,tblFeiertage[Datum],1,0)=D706,\"x\"),\"\")","v":""}]
[{"$f":"IF(DAY(D707)=1,D707,\"\")","v":""},null,{"$f":"IFERROR(VLOOKUP($D706,tblFeiertage[],2,0),\"\")","v":""},null,{"$f":"IFERROR(IF(VLOOKUP(D707,tblFeiertage[Datum],1,0)=D707,\"x\"),\"\")","v":""}]
["",null,{"$f":"D708","v":"2019-12-19"},{"$f":"D706+1","v":"2019-12-19"},{"$f":"IFERROR(IF(VLOOKUP(D708,tblFeiertage[Datum],1,0)=D708,\"x\"),\"\")","v":""}]
["",null,{"$f":"IFERROR(VLOOKUP($D708,tblFeiertage[],2,0),\"\")","v":""},null,{"$f":"IFERROR(IF(VLOOKUP(D709,tblFeiertage[Datum],1,0)=D709,\"x\"),\"\")","v":""}]
["",null,{"$f":"D710","v":"2019-12-20"},{"$f":"D708+1","v":"2019-12-20"},{"$f":"IFERROR(IF(VLOOKUP(D710,tblFeiertage[Datum],1,0)=D710,\"x\"),\"\")","v":""}]
["",null,{"$f":"IFERROR(VLOOKUP($D710,tblFeiertage[],2,0),\"\")","v":""},null,{"$f":"IFERROR(IF(VLOOKUP(D711,tblFeiertage[Datum],1,0)=D711,\"x\"),\"\")","v":""}]
["",null,{"$f":"D712","v":"2019-12-21"},{"$f":"D710+1","v":"2019-12-21"},{"$f":"IFERROR(IF(VLOOKUP(D712,tblFeiertage[Datum],1,0)=D712,\"x\"),\"\")","v":""}]
["",null,{"$f":"IFERROR(VLOOKUP($D712,tblFeiertage[],2,0),\"\")","v":""},null,{"$f":"IFERROR(IF(VLOOKUP(D713,tblFeiertage[Datum],1,0)=D713,\"x\"),\"\")","v":""}]
["",{"$f":"WEEKNUM(C714)","v":52},{"$f":"D714","v":"2019-12-22"},{"$f":"D712+1","v":"2019-12-22"},{"$f":"IFERROR(IF(VLOOKUP(D714,tblFeiertage[Datum],1,0)=D714,\"x\"),\"\")","v":""}]
["",null,{"$f":"IFERROR(VLOOKUP($D714,tblFeiertage[],2,0),\"\")","v":""},null,{"$f":"IFERROR(IF(VLOOKUP(D715,tblFeiertage[Datum],1,0)=D715,\"x\"),\"\")","v":""}]
["",null,{"$f":"D716","v":"2019-12-23"},{"$f":"D714+1","v":"2019-12-23"},{"$f":"IFERROR(IF(VLOOKUP(D716,tblFeiertage[Datum],1,0)=D716,\"x\"),\"\")","v":""}]
["",null,{"$f":"IFERROR(VLOOKUP($D716,tblFeiertage[],2,0),\"\")","v":""},null,{"$f":"IFERROR(IF(VLOOKUP(D717,tblFeiertage[Datum],1,0)=D717,\"x\"),\"\")","v":""}]
["",null,{"$f":"D718","v":"2019-12-24"},{"$f":"D716+1","v":"2019-12-24"},{"$f":"IFERROR(IF(VLOOKUP(D718,tblFeiertage[Datum],1,0)=D718,\"x\"),\"\")","v":""}]
["",null,{"$f":"IFERROR(VLOOKUP($D718,tblFeiertage[],2,0),\"\")","v":""},null,{"$f":"IFERROR(IF(VLOOKUP(D719,tblFeiertage[Datum],1,0)=D719,\"x\"),\"\")","v":""}]
["",null,{"$f":"D720","v":"2019-12-25"},{"$f":"D718+1","v":"2019-12-25"},{"$f":"IFERROR(IF(VLOOKUP(D720,tblFeiertage[Datum],1,0)=D720,\"x\"),\"\")","v":"x"}]
["",null,{"$f":"IFERROR(VLOOKUP($D720,tblFeiertage[],2,0),\"\")","v":"Weihnachten"},null,{"$f":"IFERROR(IF(VLOOKUP(D721,tblFeiertage[Datum],1,0)=D721,\"x\"),\"\")","v":""}]
["",null,{"$f":"D722","v":"2019-12-26"},{"$f":"D720+1","v":"2019-12-26"},{"$f":"IFERROR(IF(VLOOKUP(D722,tblFeiertage[Datum],1,0)=D722,\"x\"),\"\")","v":"x"}]
["",null,{"$f":"IFERROR(VLOOKUP($D722,tblFeiertage[],2,0),\"\")","v":"Stefanstag"},null,{"$f":"IFERROR(IF(VLOOKUP(D723,tblFeiertage[Datum],1,0)=D723,\"x\"),\"\")","v":""}]
["",null,{"$f":"D724","v":"2019-12-27"},{"$f":"D722+1","v":"2019-12-27"},{"$f":"IFERROR(IF(VLOOKUP(D724,tblFeiertage[Datum],1,0)=D724,\"x\"),\"\")","v":""}]
["",null,{"$f":"IFERROR(VLOOKUP($D724,tblFeiertage[],2,0),\"\")","v":""},null,{"$f":"IFERROR(IF(VLOOKUP(D725,tblFeiertage[Datum],1,0)=D725,\"x\"),\"\")","v":""}]
["",null,{"$f":"D726","v":"2019-12-28"},{"$f":"D724+1","v":"2019-12-28"},{"$f":"IFERROR(IF(VLOOKUP(D726,tblFeiertage[Datum],1,0)=D726,\"x\"),\"\")","v":""}]
["",null,{"$f":"IFERROR(VLOOKUP($D726,tblFeiertage[],2,0),\"\")","v":""},null,{"$f":"IFERROR(IF(VLOOKUP(D727,tblFeiertage[Datum],1,0)=D727,\"x\"),\"\")","v":""}]
["",{"$f":"WEEKNUM(C728)","v":53},{"$f":"D728","v":"2019-12-29"},{"$f":"D726+1","v":"2019-12-29"},{"$f":"IFERROR(IF(VLOOKUP(D728,tblFeiertage[Datum],1,0)=D728,\"x\"),\"\")","v":""}]
["",null,{"$f":"IFERROR(VLOOKUP($D728,tblFeiertage[],2,0),\"\")","v":""},null,{"$f":"IFERROR(IF(VLOOKUP(D729,tblFeiertage[Datum],1,0)=D729,\"x\"),\"\")","v":""}]
["",null,{"$f":"D730","v":"2019-12-30"},{"$f":"D728+1","v":"2019-12-30"},{"$f":"IFERROR(IF(VLOOKUP(D730,tblFeiertage[Datum],1,0)=D730,\"x\"),\"\")","v":""}]
["",null,{"$f":"IFERROR(VLOOKUP($D730,tblFeiertage[],2,0),\"\")","v":""},null,{"$f":"IFERROR(IF(VLOOKUP(D731,tblFeiertage[Datum],1,0)=D731,\"x\"),\"\")","v":""}]
["",null,{"$f":"D732","v":"2019-12-31"},"2019-12-31",{"$f":"IFERROR(IF(VLOOKUP(D732,tblFeiertage[Datum],1,0)=D732,\"x\"),\"\")","v":"x"}]
["",null,{"$f":"IFERROR(VLOOKUP($D732,tblFeiertage[],2,0),\"\")","v":"Silvester"},null,{"$f":"IFERROR(IF(VLOOKUP(D733,tblFeiertage[Datum],1,0)=D733,\"x\"),\"\")","v":""}]
["2020-01-01",null,{"$f":"D734","v":"2020-01-01"},"2020-01-01",{"$f":"IFERROR(IF(VLOOKUP(D734,tblFeiertage[Datum],1,0)=D734,\"x\"),\"\")","v":"x"}]
["",null,{"$f":"IFERROR(VLOOKUP($D734,tblFeiertage[],2,0),\"\")","v":"Neujahr"},null,{"$f":"IFERROR(IF(VLOOKUP(D735,tblFeiertage[Datum],1,0)=D735,\"x\"),\"\")","v":""}]
["",null,{"$f":"D736","v":"2020-01-02"},"2020-01-02",{"$f":"IFERROR(IF(VLOOKUP(D736,tblFeiertage[Datum],1,0)=D736,\"x\"),\"\")","v":""}]
["",null,{"$f":"IFERROR(VLOOKUP($D736,tblFeiertage[],2,0),\"\")","v":""},null,{"$f":"IFERROR(IF(VLOOKUP(D737,tblFeiertage[Datum],1,0)=D737,\"x\"),\"\")","v":""}]
["",null,{"$f":"D738","v":"2020-01-03"},"2020-01-03",{"$f":"IFERROR(IF(VLOOKUP(D738,tblFeiertage[Datum],1,0)=D738,\"x\"),\"\")","v":""}]
["",null,{"$f":"IFERROR(VLOOKUP($D738,tblFeiertage[],2,0),\"\")","v":""},null,{"$f":"IFERROR(IF(VLOOKUP(D739,tblFeiertage[Datum],1,0)=D739,\"x\"),\"\")","v":""}]
["",null,{"$f":"D740","v":"2020-01-04"},"2020-01-04",{"$f":"IFERROR(IF(VLOOKUP(D740,tblFeiertage[Datum],1,0)=D740,\"x\"),\"\")","v":""}]
["",null,{"$f":"IFERROR(VLOOKUP($D740,tblFeiertage[],2,0),\"\")","v":""},null,{"$f":"IFERROR(IF(VLOOKUP(D741,tblFeiertage[Datum],1,0)=D741,\"x\"),\"\")","v":""}]

{"sheet":"Einstellungen","index":1,"n_rows":18,"n_cols":11,"rows_kept":18,"cut":false,"hidden":false,"merged":[]}
["Jahr",{"$f":"YEAR(TODAY())","v":2019},null,null,null,null,null,null,"Wochentag des 01 Januar",{"$f":"DATE(B1,1,1)","v":"2019-01-01"}]
[null,null,null,null,null,null,null,null,"Wochentag",{"$f":"WEEKDAY(J1,2)","v":"1900-01-02"}]
["Feiertage*",null,null,null,null,null,null,null,"KalenderWoche1",{"$f":"WEEKNUM(DATE(B1,1,1))","v":1}]
["*Nur ganze Tage",null,null,null,null,null,null,null,"AbwesenheitsTypSelection",2,{"$f":"INDEX(tblAbwesenheitsTypen[Abwesenheits Typen],AbwesenheitsTypSelection)","v":"Urlaub - Genehmigt"}]
["Datum","Beschreibung",null,null,null,null,null,null,"CurrentDate",{"$f":"TODAY()","v":"2019-06-14"}]
[{"$f":"DATE($B$1,12,31)","v":"2019-12-31"},"Silvester"]
[{"$f":"DATE($B$1,12,31)+1","v":"2020-01-01"},"Neujahr"]
[{"$f":"DATE($B$1,8,1)","v":"2019-08-01"},"Nationalfeiertag Schweiz"]
[{"$f":"DATE($B$1,10,3)","v":"2019-10-03"},"Tag der Deutschen Einheit"]
[{"$f":"DATE($B$1,12,25)","v":"2019-12-25"},"Weihnachten",null,null,null,"Abwesenheits Typen"]
[{"$f":"DATE($B$1,12,26)","v":"2019-12-26"},"Stefanstag",null,null,null,"Urlaub - Beantragt"]
[null,null,null,null,null,"Urlaub - Genehmigt"]
[null,null,null,null,null,"Komp. von Überstunden"]
[null,null,null,null,null,"Dienst. Abwesenheit"]
[null,null,null,null,null,"Kurse / Weiterbildung"]
[null,null,null,null,null,"Fachmesse"]
[null,null,null,null,null,"Militär / Zivildienst"]
[null,null,null,null,null,"Etwas anderes"]

{"sheet":"BUSY ANT","index":2,"n_rows":18,"n_cols":5,"rows_kept":18,"cut":false,"hidden":false,"merged":[[3,1,3,9],[5,1,5,9],[7,1,7,9],[10,1,10,9]]}
[]
[]
[]
[null,"BUSY ANT PRO Arbeitszeiterfassung und Absenzmeldungen für KMUs"]
[]
[null,"Suchen Sie eine Arbeitszeiterfassung mit integrierten Absenzmeldungen?"]
[]
[null,"Schauen Sie sich BUSY ANT Arbeitszeiterfassung von ExcelNova an!"]
[]
[]
[null,"BUSY ANT PRO Vorteile"]
[null,null,null,"-","Arbeitszeit- UND Abwesenheitserfassung"]
[null,null,null,"-","1 Register pro Monat und ein Jahresübersichtsblatt"]
[null,null,null,"-","Professionelle und Übersichtliche Darstellung"]
[null,null,null,"-","Felder für Personalnummer und Lohnbuchhaltung"]
[null,null,null,"-","Urlaubsanspruch Saldo"]
[null,null,null,"-","Überstunden und Minderstunden Saldo"]
[null,null,null,null,"...und noch vieles mehr!!!"]