{"text_format":"1","workbook":"xlsx","n_sheets":5,"sheets":["Dashboard","Daten_Aargau","Metadata","GeoDaten","Karte"],"not_rendered":{"charts":2,"images":6,"macros":1,"external_links":0,"defined_names":6,"comments":0,"pivot_tables":0},"unopened":[],"bounds":{"document_bytes":16777216,"sheet_cells":100000,"rows_first":2000,"rows_last":500,"rows_between":2000,"halvings":0,"cell_chars":16384,"cell_head_chars":4096},"cells_cut":0,"cells_raw":0,"read":"whole","date_system":"1900"}

{"sheet":"Dashboard","index":0,"n_rows":83,"n_cols":20,"rows_kept":83,"cut":false,"hidden":false,"merged":[]}
[null,"Aargau im Wachstum"]
[null,"Einwohnerzahlen nach Gemeinden"]
[]
[null,"Gemeinde",null,null,null,"Karte",null,null,null,null,null,null,null,"Wachstum"]
[null,null,null,null,null,null,null,null,null,null,null,null,null,null,"1981-1990","1991-2000","2001-2011","Rang","1981-2011","Rang"]
[null,null,null,null,null,null,null,null,null,null,null,null,null,{"$f":"auswahlGemeinde","v":"Holziken"},{"$f":"VLOOKUP(auswahlGemeinde,tblAargau[],COLUMN(tblAargau[1981-1990]),0)","v":7.0588235294117618E-2},{"$f":"VLOOKUP(auswahlGemeinde,tblAargau[],COLUMN(tblAargau[1991-2000]),0)","v":0.11859582542694502},{"$f":"VLOOKUP(auswahlGemeinde,tblAargau[],COLUMN(tblAargau[2001-2011]),0)","v":6.0580204778156954E-2},{"$f":"VLOOKUP(auswahlGemeinde,tblAargau[],COLUMN(tblAargau[RangW.2011]),0)","v":154},{"$f":"VLOOKUP(auswahlGemeinde,tblAargau[],COLUMN(tblAargau[1981-2011]),0)","v":0.32941176470588229},{"$f":"VLOOKUP(auswahlGemeinde,tblAargau[],COLUMN(tblAargau[RangW.Gesamt]),0)","v":143}]
[null,null,null,null,null,null,null,null,null,null,null,null,null,"Aargau",{"$f":"Daten_Aargau!AH223","v":8.9822622791575712E-2},{"$f":"Daten_Aargau!AI223","v":7.3858531123429216E-2},{"$f":"Daten_Aargau!AJ223","v":0.10547655167145065},null,{"$f":"Daten_Aargau!AL223","v":0.33565631325285317}]
[null,null,null,null,null,null,null,null,null,null,null,null,null,"Schweiz",{"$f":"Daten_Aargau!AH224","v":5.9280510109676943E-2},{"$f":"Daten_Aargau!AI224","v":5.2798370483991164E-2},{"$f":"Daten_Aargau!AJ224","v":9.605572372328175E-2},null,{"$f":"Daten_Aargau!AL224","v":0.24787694903296842}]
[]
[]
[]
[]
[]
[]
[]
[]
[]
[]
[null,"Gemeinde"]
[null,"Namen",null,{"$f":"auswahlGemeinde","v":"Holziken"}]
[null,"im Bezirk",null,{"$f":"VLOOKUP(auswahlGemeinde,tblAargau[],COLUMN(tblAargau[[#Headers],[Bezirke]]),0)","v":"Kulm"}]
[null,"Einwohnerzahl (in 2011)",null,{"$f":"VLOOKUP(auswahlGemeinde,tblAargau[],COLUMN(tblAargau[[#Headers],[2011]]),0)","v":1243}]
[null,"Einwohner/km²",null,{"$f":"VLOOKUP(auswahlGemeinde,tblAargau[],COLUMN(tblAargau[[#Headers],[Einwohner/km²]]),0)","v":435}]
[null,"Fläche in km²",null,{"$f":"VLOOKUP(auswahlGemeinde,tblAargau[],COLUMN(tblAargau[[#Headers],[Fläche in km²]]),0)","v":2.86}]
[null,"Gemeinde Steuerfuss",null,{"$f":"VLOOKUP(auswahlGemeinde,tblAargau[],COLUMN(tblAargau[[#Headers],[Tax]]),0)&\" %\"","v":"104 %"}]
[]
[]
[]
[]
[]
[]
[]
[]
[]
[]
[]
[]
[null,"Aargauische Gemeinden nach Rang"]
[]
[null,null,null,null,null,"Top Ten","Gemeinde","Einwohnerzahl","Einwohner/km²","Fläche in km²","Wachstum 2001 - 2011","Wachstum 1981 - 2011"]
[null,null,null,null,null,"Rang"]
[null,null,null,null,null,1,{"$f":"INDEX(tblAargau[Gemeinde],MATCH(F42,OFFSET(tblAargau[Gemeinde],0,VLOOKUP($B$82,nfRefTabelle,3,0)-1),0))","v":"Wettingen"},{"$f":"VLOOKUP($G42,tblAargau[],VLOOKUP(H$40,nfRefTabelle,2,0),0)","v":20230},{"$f":"VLOOKUP($G42,tblAargau[],VLOOKUP(I$40,nfRefTabelle,2,0),0)","v":1907},{"$f":"VLOOKUP($G42,tblAargau[],VLOOKUP(J$40,nfRefTabelle,2,0),0)","v":10.61},{"$f":"VLOOKUP($G42,tblAargau[],VLOOKUP(K$40,nfRefTabelle,2,0),0)","v":0.12176999001885336},{"$f":"VLOOKUP($G42,tblAargau[],VLOOKUP(L$40,nfRefTabelle,2,0),0)","v":0.1100746268656716}]
[null,null,null,null,null,2,{"$f":"INDEX(tblAargau[Gemeinde],MATCH(F43,OFFSET(tblAargau[Gemeinde],0,VLOOKUP($B$82,nfRefTabelle,3,0)-1),0))","v":"Aarau"},{"$f":"VLOOKUP($G43,tblAargau[],VLOOKUP(H$40,nfRefTabelle,2,0),0)","v":20043},{"$f":"VLOOKUP($G43,tblAargau[],VLOOKUP(I$40,nfRefTabelle,2,0),0)","v":1624},{"$f":"VLOOKUP($G43,tblAargau[],VLOOKUP(J$40,nfRefTabelle,2,0),0)","v":12.33},{"$f":"VLOOKUP($G43,tblAargau[],VLOOKUP(K$40,nfRefTabelle,2,0),0)","v":0.11697503343736071},{"$f":"VLOOKUP($G43,tblAargau[],VLOOKUP(L$40,nfRefTabelle,2,0),0)","v":0.12734124528938628}]
[null,null,null,null,null,3,{"$f":"INDEX(tblAargau[Gemeinde],MATCH(F44,OFFSET(tblAargau[Gemeinde],0,VLOOKUP($B$82,nfRefTabelle,3,0)-1),0))","v":"Baden"},{"$f":"VLOOKUP($G44,tblAargau[],VLOOKUP(H$40,nfRefTabelle,2,0),0)","v":18404},{"$f":"VLOOKUP($G44,tblAargau[],VLOOKUP(I$40,nfRefTabelle,2,0),0)","v":1396},{"$f":"VLOOKUP($G44,tblAargau[],VLOOKUP(J$40,nfRefTabelle,2,0),0)","v":13.18},{"$f":"VLOOKUP($G44,tblAargau[],VLOOKUP(K$40,nfRefTabelle,2,0),0)","v":0.13752395080042024},{"$f":"VLOOKUP($G44,tblAargau[],VLOOKUP(L$40,nfRefTabelle,2,0),0)","v":0.32832912306026696}]
[null,null,null,null,null,4,{"$f":"INDEX(tblAargau[Gemeinde],MATCH(F45,OFFSET(tblAargau[Gemeinde],0,VLOOKUP($B$82,nfRefTabelle,3,0)-1),0))","v":"Wohlen (AG)"},{"$f":"VLOOKUP($G45,tblAargau[],VLOOKUP(H$40,nfRefTabelle,2,0),0)","v":14623},{"$f":"VLOOKUP($G45,tblAargau[],VLOOKUP(I$40,nfRefTabelle,2,0),0)","v":1172},{"$f":"VLOOKUP($G45,tblAargau[],VLOOKUP(J$40,nfRefTabelle,2,0),0)","v":12.48},{"$f":"VLOOKUP($G45,tblAargau[],VLOOKUP(K$40,nfRefTabelle,2,0),0)","v":8.2063045730353723E-2},{"$f":"VLOOKUP($G45,tblAargau[],VLOOKUP(L$40,nfRefTabelle,2,0),0)","v":0.26136461657897003}]
[null,null,null,null,null,5,{"$f":"INDEX(tblAargau[Gemeinde],MATCH(F46,OFFSET(tblAargau[Gemeinde],0,VLOOKUP($B$82,nfRefTabelle,3,0)-1),0))","v":"Oftringen"},{"$f":"VLOOKUP($G46,tblAargau[],VLOOKUP(H$40,nfRefTabelle,2,0),0)","v":12618},{"$f":"VLOOKUP($G46,tblAargau[],VLOOKUP(I$40,nfRefTabelle,2,0),0)","v":982},{"$f":"VLOOKUP($G46,tblAargau[],VLOOKUP(J$40,nfRefTabelle,2,0),0)","v":12.85},{"$f":"VLOOKUP($G46,tblAargau[],VLOOKUP(K$40,nfRefTabelle,2,0),0)","v":0.23306948109058934},{"$f":"VLOOKUP($G46,tblAargau[],VLOOKUP(L$40,nfRefTabelle,2,0),0)","v":0.40763052208835338}]
[null,null,null,null,null,6,{"$f":"INDEX(tblAargau[Gemeinde],MATCH(F47,OFFSET(tblAargau[Gemeinde],0,VLOOKUP($B$82,nfRefTabelle,3,0)-1),0))","v":"Rheinfelden"},{"$f":"VLOOKUP($G47,tblAargau[],VLOOKUP(H$40,nfRefTabelle,2,0),0)","v":12074},{"$f":"VLOOKUP($G47,tblAargau[],VLOOKUP(I$40,nfRefTabelle,2,0),0)","v":753},{"$f":"VLOOKUP($G47,tblAargau[],VLOOKUP(J$40,nfRefTabelle,2,0),0)","v":16.03},{"$f":"VLOOKUP($G47,tblAargau[],VLOOKUP(K$40,nfRefTabelle,2,0),0)","v":0.12557098909294306},{"$f":"VLOOKUP($G47,tblAargau[],VLOOKUP(L$40,nfRefTabelle,2,0),0)","v":0.26707944170427123}]
[null,null,null,null,null,7,{"$f":"INDEX(tblAargau[Gemeinde],MATCH(F48,OFFSET(tblAargau[Gemeinde],0,VLOOKUP($B$82,nfRefTabelle,3,0)-1),0))","v":"Zofingen"},{"$f":"VLOOKUP($G48,tblAargau[],VLOOKUP(H$40,nfRefTabelle,2,0),0)","v":10990},{"$f":"VLOOKUP($G48,tblAargau[],VLOOKUP(I$40,nfRefTabelle,2,0),0)","v":991},{"$f":"VLOOKUP($G48,tblAargau[],VLOOKUP(J$40,nfRefTabelle,2,0),0)","v":11.09},{"$f":"VLOOKUP($G48,tblAargau[],VLOOKUP(K$40,nfRefTabelle,2,0),0)","v":0.14658320292123106},{"$f":"VLOOKUP($G48,tblAargau[],VLOOKUP(L$40,nfRefTabelle,2,0),0)","v":0.19262072707542055}]
[null,null,null,null,null,8,{"$f":"INDEX(tblAargau[Gemeinde],MATCH(F49,OFFSET(tblAargau[Gemeinde],0,VLOOKUP($B$82,nfRefTabelle,3,0)-1),0))","v":"Spreitenbach"},{"$f":"VLOOKUP($G49,tblAargau[],VLOOKUP(H$40,nfRefTabelle,2,0),0)","v":10955},{"$f":"VLOOKUP($G49,tblAargau[],VLOOKUP(I$40,nfRefTabelle,2,0),0)","v":1274},{"$f":"VLOOKUP($G49,tblAargau[],VLOOKUP(J$40,nfRefTabelle,2,0),0)","v":8.6},{"$f":"VLOOKUP($G49,tblAargau[],VLOOKUP(K$40,nfRefTabelle,2,0),0)","v":0.15291517575247315},{"$f":"VLOOKUP($G49,tblAargau[],VLOOKUP(L$40,nfRefTabelle,2,0),0)","v":0.49638027591859046}]
[null,null,null,null,null,9,{"$f":"INDEX(tblAargau[Gemeinde],MATCH(F50,OFFSET(tblAargau[Gemeinde],0,VLOOKUP($B$82,nfRefTabelle,3,0)-1),0))","v":"Brugg"},{"$f":"VLOOKUP($G50,tblAargau[],VLOOKUP(H$40,nfRefTabelle,2,0),0)","v":10545},{"$f":"VLOOKUP($G50,tblAargau[],VLOOKUP(I$40,nfRefTabelle,2,0),0)","v":1653},{"$f":"VLOOKUP($G50,tblAargau[],VLOOKUP(J$40,nfRefTabelle,2,0),0)","v":6.36},{"$f":"VLOOKUP($G50,tblAargau[],VLOOKUP(K$40,nfRefTabelle,2,0),0)","v":2.9282576866764165E-2},{"$f":"VLOOKUP($G50,tblAargau[],VLOOKUP(L$40,nfRefTabelle,2,0),0)","v":7.4157074462666728E-2}]
[null,null,null,null,null,10,{"$f":"INDEX(tblAargau[Gemeinde],MATCH(F51,OFFSET(tblAargau[Gemeinde],0,VLOOKUP($B$82,nfRefTabelle,3,0)-1),0))","v":"Möhlin"},{"$f":"VLOOKUP($G51,tblAargau[],VLOOKUP(H$40,nfRefTabelle,2,0),0)","v":10201},{"$f":"VLOOKUP($G51,tblAargau[],VLOOKUP(I$40,nfRefTabelle,2,0),0)","v":543},{"$f":"VLOOKUP($G51,tblAargau[],VLOOKUP(J$40,nfRefTabelle,2,0),0)","v":18.79},{"$f":"VLOOKUP($G51,tblAargau[],VLOOKUP(K$40,nfRefTabelle,2,0),0)","v":0.21773904739166761},{"$f":"VLOOKUP($G51,tblAargau[],VLOOKUP(L$40,nfRefTabelle,2,0),0)","v":0.61153238546603483}]
[]
[null,null,null,null,null,"Bottom Five",null,"Einwohnerzahl","Einwohner/km²","Fläche in km²","Wachstum 2001 - 2011","Wachstum 1981 - 2011"]
[null,null,null,null,null,"Rang"]
[null,null,null,null,null,{"$f":"F56-1","v":215},{"$f":"INDEX(tblAargau[Gemeinde],MATCH(F55,OFFSET(tblAargau[Gemeinde],0,VLOOKUP($B$82,nfRefTabelle,3,0)-1),0))","v":"Geltwil"},{"$f":"VLOOKUP($G55,tblAargau[],VLOOKUP(H$40,nfRefTabelle,2,0),0)","v":187},{"$f":"VLOOKUP($G55,tblAargau[],VLOOKUP(I$40,nfRefTabelle,2,0),0)","v":57},{"$f":"VLOOKUP($G55,tblAargau[],VLOOKUP(J$40,nfRefTabelle,2,0),0)","v":3.3},{"$f":"VLOOKUP($G55,tblAargau[],VLOOKUP(K$40,nfRefTabelle,2,0),0)","v":0.20645161290322589},{"$f":"VLOOKUP($G55,tblAargau[],VLOOKUP(L$40,nfRefTabelle,2,0),0)","v":0.4274809160305344}]
[null,null,null,null,null,{"$f":"F57-1","v":216},{"$f":"INDEX(tblAargau[Gemeinde],MATCH(F56,OFFSET(tblAargau[Gemeinde],0,VLOOKUP($B$82,nfRefTabelle,3,0)-1),0))","v":"Wiliberg"},{"$f":"VLOOKUP($G56,tblAargau[],VLOOKUP(H$40,nfRefTabelle,2,0),0)","v":168},{"$f":"VLOOKUP($G56,tblAargau[],VLOOKUP(I$40,nfRefTabelle,2,0),0)","v":144},{"$f":"VLOOKUP($G56,tblAargau[],VLOOKUP(J$40,nfRefTabelle,2,0),0)","v":1.17},{"$f":"VLOOKUP($G56,tblAargau[],VLOOKUP(K$40,nfRefTabelle,2,0),0)","v":9.0909090909090828E-2},{"$f":"VLOOKUP($G56,tblAargau[],VLOOKUP(L$40,nfRefTabelle,2,0),0)","v":0.38842975206611574}]
[null,null,null,null,null,{"$f":"F58-1","v":217},{"$f":"INDEX(tblAargau[Gemeinde],MATCH(F57,OFFSET(tblAargau[Gemeinde],0,VLOOKUP($B$82,nfRefTabelle,3,0)-1),0))","v":"Böbikon"},{"$f":"VLOOKUP($G57,tblAargau[],VLOOKUP(H$40,nfRefTabelle,2,0),0)","v":161},{"$f":"VLOOKUP($G57,tblAargau[],VLOOKUP(I$40,nfRefTabelle,2,0),0)","v":62},{"$f":"VLOOKUP($G57,tblAargau[],VLOOKUP(J$40,nfRefTabelle,2,0),0)","v":2.59},{"$f":"VLOOKUP($G57,tblAargau[],VLOOKUP(K$40,nfRefTabelle,2,0),0)","v":-0.13440860215053763},{"$f":"VLOOKUP($G57,tblAargau[],VLOOKUP(L$40,nfRefTabelle,2,0),0)","v":0.2384615384615385}]
[null,null,null,null,null,{"$f":"F59-1","v":218},{"$f":"INDEX(tblAargau[Gemeinde],MATCH(F58,OFFSET(tblAargau[Gemeinde],0,VLOOKUP($B$82,nfRefTabelle,3,0)-1),0))","v":"Linn"},{"$f":"VLOOKUP($G58,tblAargau[],VLOOKUP(H$40,nfRefTabelle,2,0),0)","v":136},{"$f":"VLOOKUP($G58,tblAargau[],VLOOKUP(I$40,nfRefTabelle,2,0),0)","v":53},{"$f":"VLOOKUP($G58,tblAargau[],VLOOKUP(J$40,nfRefTabelle,2,0),0)","v":2.5499999999999998},{"$f":"VLOOKUP($G58,tblAargau[],VLOOKUP(K$40,nfRefTabelle,2,0),0)","v":8.8000000000000078E-2},{"$f":"VLOOKUP($G58,tblAargau[],VLOOKUP(L$40,nfRefTabelle,2,0),0)","v":0.54545454545454541}]
[null,null,null,null,null,{"$f":"COUNTA(tblAargau[Gemeinde])","v":219},{"$f":"INDEX(tblAargau[Gemeinde],MATCH(F59,OFFSET(tblAargau[Gemeinde],0,VLOOKUP($B$82,nfRefTabelle,3,0)-1),0))","v":"Gallenkirch"},{"$f":"VLOOKUP($G59,tblAargau[],VLOOKUP(H$40,nfRefTabelle,2,0),0)","v":133},{"$f":"VLOOKUP($G59,tblAargau[],VLOOKUP(I$40,nfRefTabelle,2,0),0)","v":95},{"$f":"VLOOKUP($G59,tblAargau[],VLOOKUP(J$40,nfRefTabelle,2,0),0)","v":1.4},{"$f":"VLOOKUP($G59,tblAargau[],VLOOKUP(K$40,nfRefTabelle,2,0),0)","v":6.4000000000000057E-2},{"$f":"VLOOKUP($G59,tblAargau[],VLOOKUP(L$40,nfRefTabelle,2,0),0)","v":0.84722222222222232}]
[]
[]
[]
[]
[]
[]
[]
[]
[]
[]
[]
[]
[]
[]
[null,null,"AbsWert","Rang"]
[null,"Einwohnerzahl",{"$f":"COLUMN(tblAargau[[#Headers],[2011]])","v":33},{"$f":"COLUMN(tblAargau[[#Headers],[RangE.2011]])","v":34}]
[null,"Einwohner/km²",{"$f":"COLUMN(tblAargau[[#Headers],[Einwohner/km²]])","v":43},{"$f":"COLUMN(tblAargau[[#Headers],[RangDichte]])","v":44}]
[null,"Fläche in km²",{"$f":"COLUMN(tblAargau[[#Headers],[Fläche in km²]])","v":41},{"$f":"COLUMN(tblAargau[[#Headers],[RangFläche]])","v":42}]
[null,"Wachstum 2001 - 2011",{"$f":"COLUMN(tblAargau[[#Headers],[2001-2011]])","v":37},{"$f":"COLUMN(tblAargau[[#Headers],[RangW.2011]])","v":38}]
[null,"Wachstum 1981 - 2011",{"$f":"COLUMN(tblAargau[[#Headers],[1981-2011]])","v":39},{"$f":"COLUMN(tblAargau[[#Headers],[RangW.Gesamt]])","v":40}]
[]
[]
[null,"Einwohnerzahl"]
[null,"Holziken"]

{"sheet":"Daten_Aargau","index":1,"n_rows":230,"n_cols":46,"rows_kept":230,"cut":false,"hidden":false,"merged":[]}
["Gemeinde","Bezirke","1981","1982","1983","1984","1985","1986","1987","1988","1989","1990","1991","1992","1993","1994","1995","1996","1997","1998","1999","2000","2001","2002","2003","2004","2005","2006","2007","2008","2009","2010","2011","RangE.2011","1981-1990","1991-2000","2001-2011","RangW.2011","1981-2011","RangW.Gesamt","Fläche in km²","RangFläche","Einwohner/km²","RangDichte","Tax","RangTax"]
["Aarau","Aarau",17779,17932,18084,18095,18069,17993,17907,17830,18128,18237,18357,18265,18516,18486,18509,18445,18090,17957,17967,17989,17944,17903,18099,18198,18270,18324,18656,18961,19289,19461,20043,{"$f":"_xlfn.RANK.EQ(tblAargau[[#This Row],[2011]],tblAargau[2011])","v":2},{"$f":"IFERROR(L2/C2-1,0)","v":2.5760728949884681E-2},{"$f":"IFERROR(V2/M2-1,0)","v":-2.0046848613607837E-2},{"$f":"IFERROR(AG2/W2-1,0)","v":0.11697503343736071},{"$f":"_xlfn.RANK.EQ(tblAargau[[#This Row],[2001-2011]],tblAargau[2001-2011])","v":111},{"$f":"IFERROR(AG2/C2-1,0)","v":0.12734124528938628},{"$f":"_xlfn.RANK.EQ(tblAargau[[#This Row],[1981-2011]],tblAargau[1981-2011])","v":202},12.33,{"$f":"_xlfn.RANK.EQ(tblAargau[[#This Row],[Fläche in km²]],tblAargau[Fläche in km²])","v":18},1624,{"$f":"_xlfn.RANK.EQ(tblAargau[[#This Row],[Einwohner/km²]],tblAargau[Einwohner/km²])","v":4},94,{"$f":"_xlfn.RANK.EQ(tblAargau[[#This Row],[Tax]],tblAargau[Tax],1)","v":29}]
["Aarburg","Zofingen",5311,5380,5438,5508,5555,5507,5461,5460,5395,5503,5757,5843,5998,6072,6160,6278,6230,6204,6228,6281,6296,6346,6462,6518,6543,6556,6469,6633,6914,6956,7155,{"$f":"_xlfn.RANK.EQ(tblAargau[[#This Row],[2011]],tblAargau[2011])","v":20},3.6151383920165703E-2,9.1019628278617315E-2,0.13643583227445988,{"$f":"_xlfn.RANK.EQ(tblAargau[[#This Row],[2001-2011]],tblAargau[2001-2011])","v":93},0.34720391639992476,{"$f":"_xlfn.RANK.EQ(tblAargau[[#This Row],[1981-2011]],tblAargau[1981-2011])","v":138},4.42,{"$f":"_xlfn.RANK.EQ(tblAargau[[#This Row],[Fläche in km²]],tblAargau[Fläche in km²])","v":138},1619,{"$f":"_xlfn.RANK.EQ(tblAargau[[#This Row],[Einwohner/km²]],tblAargau[Einwohner/km²])","v":5},124,{"$f":"_xlfn.RANK.EQ(tblAargau[[#This Row],[Tax]],tblAargau[Tax],1)","v":214}]
["Abtwil","Muri",324,346,352,353,365,381,386,368,361,362,386,389,409,460,558,615,641,641,661,672,701,703,697,701,717,725,721,748,831,911,940,{"$f":"_xlfn.RANK.EQ(tblAargau[[#This Row],[2011]],tblAargau[2011])","v":162},0.11728395061728403,0.7409326424870466,0.34094151212553503,{"$f":"_xlfn.RANK.EQ(tblAargau[[#This Row],[2001-2011]],tblAargau[2001-2011])","v":11},1.9012345679012346,{"$f":"_xlfn.RANK.EQ(tblAargau[[#This Row],[1981-2011]],tblAargau[1981-2011])","v":3},4.1399999999999997,{"$f":"_xlfn.RANK.EQ(tblAargau[[#This Row],[Fläche in km²]],tblAargau[Fläche in km²])","v":148},227,{"$f":"_xlfn.RANK.EQ(tblAargau[[#This Row],[Einwohner/km²]],tblAargau[Einwohner/km²])","v":135},112,{"$f":"_xlfn.RANK.EQ(tblAargau[[#This Row],[Tax]],tblAargau[Tax],1)","v":130}]
["Ammerswil","Lenzburg",364,378,374,393,407,403,401,419,428,401,443,447,451,441,438,463,526,573,579,612,623,636,638,647,642,647,655,660,661,680,675,{"$f":"_xlfn.RANK.EQ(tblAargau[[#This Row],[2011]],tblAargau[2011])","v":187},0.10164835164835173,0.38148984198645608,8.3467094703049804E-2,{"$f":"_xlfn.RANK.EQ(tblAargau[[#This Row],[2001-2011]],tblAargau[2001-2011])","v":138},0.85439560439560447,{"$f":"_xlfn.RANK.EQ(tblAargau[[#This Row],[1981-2011]],tblAargau[1981-2011])","v":33},3.19,{"$f":"_xlfn.RANK.EQ(tblAargau[[#This Row],[Fläche in km²]],tblAargau[Fläche in km²])","v":181},212,{"$f":"_xlfn.RANK.EQ(tblAargau[[#This Row],[Einwohner/km²]],tblAargau[Einwohner/km²])","v":143},98,{"$f":"_xlfn.RANK.EQ(tblAargau[[#This Row],[Tax]],tblAargau[Tax],1)","v":44}]
["Aristau","Muri",741,728,738,727,725,775,797,823,860,859,864,948,1032,1077,1100,1126,1148,1138,1186,1189,1192,1217,1226,1234,1245,1245,1266,1282,1298,1295,1335,{"$f":"_xlfn.RANK.EQ(tblAargau[[#This Row],[2011]],tblAargau[2011])","v":129},0.15924426450742235,0.37615740740740744,0.11996644295302006,{"$f":"_xlfn.RANK.EQ(tblAargau[[#This Row],[2001-2011]],tblAargau[2001-2011])","v":106},0.80161943319838058,{"$f":"_xlfn.RANK.EQ(tblAargau[[#This Row],[1981-2011]],tblAargau[1981-2011])","v":42},8.64,{"$f":"_xlfn.RANK.EQ(tblAargau[[#This Row],[Fläche in km²]],tblAargau[Fläche in km²])","v":50},155,{"$f":"_xlfn.RANK.EQ(tblAargau[[#This Row],[Einwohner/km²]],tblAargau[Einwohner/km²])","v":175},109,{"$f":"_xlfn.RANK.EQ(tblAargau[[#This Row],[Tax]],tblAargau[Tax],1)","v":112}]
["Arni (AG)","Bremgarten",670,678,702,734,777,808,782,832,904,939,983,1062,1053,1102,1153,1169,1241,1259,1256,1299,1315,1449,1497,1512,1511,1541,1607,1616,1639,1741,1793,{"$f":"_xlfn.RANK.EQ(tblAargau[[#This Row],[2011]],tblAargau[2011])","v":105},0.40149253731343282,0.32146490335707023,0.3634980988593155,{"$f":"_xlfn.RANK.EQ(tblAargau[[#This Row],[2001-2011]],tblAargau[2001-2011])","v":7},1.6761194029850746,{"$f":"_xlfn.RANK.EQ(tblAargau[[#This Row],[1981-2011]],tblAargau[1981-2011])","v":6},3.38,{"$f":"_xlfn.RANK.EQ(tblAargau[[#This Row],[Fläche in km²]],tblAargau[Fläche in km²])","v":170},530,{"$f":"_xlfn.RANK.EQ(tblAargau[[#This Row],[Einwohner/km²]],tblAargau[Einwohner/km²])","v":66},87,{"$f":"_xlfn.RANK.EQ(tblAargau[[#This Row],[Tax]],tblAargau[Tax],1)","v":14}]
["Attelwil","Zofingen",228,231,236,243,247,249,247,255,269,270,287,299,307,304,306,302,302,307,311,299,321,310,304,304,310,303,298,294,292,299,292,{"$f":"_xlfn.RANK.EQ(tblAargau[[#This Row],[2011]],tblAargau[2011])","v":210},0.18421052631578938,4.1811846689895571E-2,-9.0342679127725867E-2,{"$f":"_xlfn.RANK.EQ(tblAargau[[#This Row],[2001-2011]],tblAargau[2001-2011])","v":217},0.2807017543859649,{"$f":"_xlfn.RANK.EQ(tblAargau[[#This Row],[1981-2011]],tblAargau[1981-2011])","v":160},2.2200000000000002,{"$f":"_xlfn.RANK.EQ(tblAargau[[#This Row],[Fläche in km²]],tblAargau[Fläche in km²])","v":208},132,{"$f":"_xlfn.RANK.EQ(tblAargau[[#This Row],[Einwohner/km²]],tblAargau[Einwohner/km²])","v":185},98,{"$f":"_xlfn.RANK.EQ(tblAargau[[#This Row],[Tax]],tblAargau[Tax],1)","v":44}]
["Auenstein","Brugg",1141,1144,1148,1161,1126,1132,1115,1125,1163,1177,1217,1266,1306,1365,1377,1354,1360,1376,1389,1382,1384,1385,1415,1445,1424,1432,1447,1447,1487,1509,1546,{"$f":"_xlfn.RANK.EQ(tblAargau[[#This Row],[2011]],tblAargau[2011])","v":114},3.1551270815074473E-2,0.1355792933442892,0.11705202312138718,{"$f":"_xlfn.RANK.EQ(tblAargau[[#This Row],[2001-2011]],tblAargau[2001-2011])","v":110},0.35495179666958809,{"$f":"_xlfn.RANK.EQ(tblAargau[[#This Row],[1981-2011]],tblAargau[1981-2011])","v":135},5.68,{"$f":"_xlfn.RANK.EQ(tblAargau[[#This Row],[Fläche in km²]],tblAargau[Fläche in km²])","v":103},272,{"$f":"_xlfn.RANK.EQ(tblAargau[[#This Row],[Einwohner/km²]],tblAargau[Einwohner/km²])","v":123},92,{"$f":"_xlfn.RANK.EQ(tblAargau[[#This Row],[Tax]],tblAargau[Tax],1)","v":26}]
["Auw","Muri",949,966,946,948,974,967,980,998,1009,1011,1081,1123,1098,1110,1150,1150,1141,1163,1182,1217,1278,1342,1429,1493,1551,1537,1551,1580,1614,1679,1738,{"$f":"_xlfn.RANK.EQ(tblAargau[[#This Row],[2011]],tblAargau[2011])","v":107},6.5331928345627066E-2,0.125809435707678,0.35993740219092341,{"$f":"_xlfn.RANK.EQ(tblAargau[[#This Row],[2001-2011]],tblAargau[2001-2011])","v":8},0.83140147523709174,{"$f":"_xlfn.RANK.EQ(tblAargau[[#This Row],[1981-2011]],tblAargau[1981-2011])","v":37},8.57,{"$f":"_xlfn.RANK.EQ(tblAargau[[#This Row],[Fläche in km²]],tblAargau[Fläche in km²])","v":53},203,{"$f":"_xlfn.RANK.EQ(tblAargau[[#This Row],[Einwohner/km²]],tblAargau[Einwohner/km²])","v":150},111,{"$f":"_xlfn.RANK.EQ(tblAargau[[#This Row],[Tax]],tblAargau[Tax],1)","v":128}]
["Bad Zurzach","Zurzach",3066,3125,3145,3109,3210,3301,3320,3371,3402,3452,3646,3752,3846,3898,3875,3866,3841,3784,3859,3867,3922,3918,3950,4018,4023,3990,4003,4030,4058,4120,4167,{"$f":"_xlfn.RANK.EQ(tblAargau[[#This Row],[2011]],tblAargau[2011])","v":45},0.12589693411611225,6.0614371914426757E-2,6.2468128505864362E-2,{"$f":"_xlfn.RANK.EQ(tblAargau[[#This Row],[2001-2011]],tblAargau[2001-2011])","v":152},0.35909980430528377,{"$f":"_xlfn.RANK.EQ(tblAargau[[#This Row],[1981-2011]],tblAargau[1981-2011])","v":133},6.52,{"$f":"_xlfn.RANK.EQ(tblAargau[[#This Row],[Fläche in km²]],tblAargau[Fläche in km²])","v":82},639,{"$f":"_xlfn.RANK.EQ(tblAargau[[#This Row],[Einwohner/km²]],tblAargau[Einwohner/km²])","v":51},115,{"$f":"_xlfn.RANK.EQ(tblAargau[[#This Row],[Tax]],tblAargau[Tax],1)","v":150}]
["Baden","Baden",13855,13993,14015,14049,14054,14058,14136,14393,14545,14780,14980,15228,15592,15590,15756,15968,15933,15984,16026,15945,16179,16313,16210,16220,16295,16691,16860,17446,17709,17828,18404,{"$f":"_xlfn.RANK.EQ(tblAargau[[#This Row],[2011]],tblAargau[2011])","v":3},6.6762901479610282E-2,6.44192256341789E-2,0.13752395080042024,{"$f":"_xlfn.RANK.EQ(tblAargau[[#This Row],[2001-2011]],tblAargau[2001-2011])","v":88},0.32832912306026696,{"$f":"_xlfn.RANK.EQ(tblAargau[[#This Row],[1981-2011]],tblAargau[1981-2011])","v":144},13.18,{"$f":"_xlfn.RANK.EQ(tblAargau[[#This Row],[Fläche in km²]],tblAargau[Fläche in km²])","v":12},1396,{"$f":"_xlfn.RANK.EQ(tblAargau[[#This Row],[Einwohner/km²]],tblAargau[Einwohner/km²])","v":8},95,{"$f":"_xlfn.RANK.EQ(tblAargau[[#This Row],[Tax]],tblAargau[Tax],1)","v":30}]
["Baldingen","Zurzach",141,142,145,155,158,169,176,192,205,209,230,226,228,241,255,257,262,259,259,253,249,250,260,262,265,272,274,288,284,289,278,{"$f":"_xlfn.RANK.EQ(tblAargau[[#This Row],[2011]],tblAargau[2011])","v":212},0.48226950354609932,0.10000000000000009,0.11646586345381515,{"$f":"_xlfn.RANK.EQ(tblAargau[[#This Row],[2001-2011]],tblAargau[2001-2011])","v":113},0.97163120567375882,{"$f":"_xlfn.RANK.EQ(tblAargau[[#This Row],[1981-2011]],tblAargau[1981-2011])","v":27},2.83,{"$f":"_xlfn.RANK.EQ(tblAargau[[#This Row],[Fläche in km²]],tblAargau[Fläche in km²])","v":190},98,{"$f":"_xlfn.RANK.EQ(tblAargau[[#This Row],[Einwohner/km²]],tblAargau[Einwohner/km²])","v":201},105,{"$f":"_xlfn.RANK.EQ(tblAargau[[#This Row],[Tax]],tblAargau[Tax],1)","v":92}]
["Beinwil (Freiamt)","Muri",684,697,694,702,695,698,714,738,748,768,863,887,931,928,950,952,978,949,942,956,948,944,945,943,922,973,1012,1016,1036,1022,1049,{"$f":"_xlfn.RANK.EQ(tblAargau[[#This Row],[2011]],tblAargau[2011])","v":147},0.12280701754385959,0.10776361529548084,0.10654008438818563,{"$f":"_xlfn.RANK.EQ(tblAargau[[#This Row],[2001-2011]],tblAargau[2001-2011])","v":120},0.53362573099415211,{"$f":"_xlfn.RANK.EQ(tblAargau[[#This Row],[1981-2011]],tblAargau[1981-2011])","v":81},11.28,{"$f":"_xlfn.RANK.EQ(tblAargau[[#This Row],[Fläche in km²]],tblAargau[Fläche in km²])","v":25},93,{"$f":"_xlfn.RANK.EQ(tblAargau[[#This Row],[Einwohner/km²]],tblAargau[Einwohner/km²])","v":203},109,{"$f":"_xlfn.RANK.EQ(tblAargau[[#This Row],[Tax]],tblAargau[Tax],1)","v":112}]
["Beinwil am See","Kulm",2259,2286,2317,2319,2325,2347,2359,2356,2350,2344,2425,2405,2397,2477,2487,2500,2559,2572,2580,2603,2617,2628,2613,2636,2650,2688,2714,2736,2795,2829,2890,{"$f":"_xlfn.RANK.EQ(tblAargau[[#This Row],[2011]],tblAargau[2011])","v":71},3.7627268702965955E-2,7.3402061855670109E-2,0.10431792128391293,{"$f":"_xlfn.RANK.EQ(tblAargau[[#This Row],[2001-2011]],tblAargau[2001-2011])","v":122},0.27932713590084113,{"$f":"_xlfn.RANK.EQ(tblAargau[[#This Row],[1981-2011]],tblAargau[1981-2011])","v":161},3.84,{"$f":"_xlfn.RANK.EQ(tblAargau[[#This Row],[Fläche in km²]],tblAargau[Fläche in km²])","v":158},753,{"$f":"_xlfn.RANK.EQ(tblAargau[[#This Row],[Einwohner/km²]],tblAargau[Einwohner/km²])","v":44},99,{"$f":"_xlfn.RANK.EQ(tblAargau[[#This Row],[Tax]],tblAargau[Tax],1)","v":53}]
["Bellikon","Baden",948,977,999,976,970,987,1009,1028,1049,1062,1046,1096,1144,1175,1196,1232,1248,1235,1268,1322,1335,1319,1429,1444,1425,1458,1466,1507,1537,1569,1594,{"$f":"_xlfn.RANK.EQ(tblAargau[[#This Row],[2011]],tblAargau[2011])","v":111},0.120253164556962,0.2638623326959848,0.19400749063670419,{"$f":"_xlfn.RANK.EQ(tblAargau[[#This Row],[2001-2011]],tblAargau[2001-2011])","v":42},0.68143459915611815,{"$f":"_xlfn.RANK.EQ(tblAargau[[#This Row],[1981-2011]],tblAargau[1981-2011])","v":54},4.95,{"$f":"_xlfn.RANK.EQ(tblAargau[[#This Row],[Fläche in km²]],tblAargau[Fläche in km²])","v":122},322,{"$f":"_xlfn.RANK.EQ(tblAargau[[#This Row],[Einwohner/km²]],tblAargau[Einwohner/km²])","v":111},89,{"$f":"_xlfn.RANK.EQ(tblAargau[[#This Row],[Tax]],tblAargau[Tax],1)","v":19}]
["Bergdietikon","Baden",1780,1855,1930,1984,1982,2010,2062,2080,2101,2153,2210,2212,2215,2210,2225,2204,2213,2240,2243,2249,2281,2274,2259,2252,2254,2239,2201,2246,2343,2361,2386,{"$f":"_xlfn.RANK.EQ(tblAargau[[#This Row],[2011]],tblAargau[2011])","v":86},0.20955056179775289,1.7647058823529349E-2,4.6032441911442401E-2,{"$f":"_xlfn.RANK.EQ(tblAargau[[#This Row],[2001-2011]],tblAargau[2001-2011])","v":163},0.34044943820224716,{"$f":"_xlfn.RANK.EQ(tblAargau[[#This Row],[1981-2011]],tblAargau[1981-2011])","v":139},5.93,{"$f":"_xlfn.RANK.EQ(tblAargau[[#This Row],[Fläche in km²]],tblAargau[Fläche in km²])","v":95},402,{"$f":"_xlfn.RANK.EQ(tblAargau[[#This Row],[Einwohner/km²]],tblAargau[Einwohner/km²])","v":91},87,{"$f":"_xlfn.RANK.EQ(tblAargau[[#This Row],[Tax]],tblAargau[Tax],1)","v":14}]
["Berikon","Bremgarten",2411,2577,2742,2889,3045,3246,3518,3560,3638,3720,3821,3848,3870,4036,4111,4151,4350,4326,4393,4389,4337,4303,4408,4397,4380,4351,4391,4473,4504,4551,4553,{"$f":"_xlfn.RANK.EQ(tblAargau[[#This Row],[2011]],tblAargau[2011])","v":37},0.54292824554126917,0.14865218529180835,4.9804011989854846E-2,{"$f":"_xlfn.RANK.EQ(tblAargau[[#This Row],[2001-2011]],tblAargau[2001-2011])","v":161},0.8884280381584404,{"$f":"_xlfn.RANK.EQ(tblAargau[[#This Row],[1981-2011]],tblAargau[1981-2011])","v":30},5.37,{"$f":"_xlfn.RANK.EQ(tblAargau[[#This Row],[Fläche in km²]],tblAargau[Fläche in km²])","v":111},848,{"$f":"_xlfn.RANK.EQ(tblAargau[[#This Row],[Einwohner/km²]],tblAargau[Einwohner/km²])","v":35},92,{"$f":"_xlfn.RANK.EQ(tblAargau[[#This Row],[Tax]],tblAargau[Tax],1)","v":26}]
["Besenbüren","Muri",290,300,305,318,326,342,343,345,354,373,396,406,421,408,424,425,417,439,474,510,526,532,556,584,578,574,592,581,589,593,576,{"$f":"_xlfn.RANK.EQ(tblAargau[[#This Row],[2011]],tblAargau[2011])","v":193},0.28620689655172415,0.28787878787878785,9.5057034220532355E-2,{"$f":"_xlfn.RANK.EQ(tblAargau[[#This Row],[2001-2011]],tblAargau[2001-2011])","v":127},0.98620689655172411,{"$f":"_xlfn.RANK.EQ(tblAargau[[#This Row],[1981-2011]],tblAargau[1981-2011])","v":25},2.38,{"$f":"_xlfn.RANK.EQ(tblAargau[[#This Row],[Fläche in km²]],tblAargau[Fläche in km²])","v":205},242,{"$f":"_xlfn.RANK.EQ(tblAargau[[#This Row],[Einwohner/km²]],tblAargau[Einwohner/km²])","v":132},116,{"$f":"_xlfn.RANK.EQ(tblAargau[[#This Row],[Tax]],tblAargau[Tax],1)","v":164}]
["Bettwil","Muri",390,397,394,397,421,429,434,444,468,485,514,519,529,540,544,568,574,564,566,561,570,560,549,540,540,548,565,551,549,553,555,{"$f":"_xlfn.RANK.EQ(tblAargau[[#This Row],[2011]],tblAargau[2011])","v":195},0.24358974358974361,9.1439688715953205E-2,-2.6315789473684181E-2,{"$f":"_xlfn.RANK.EQ(tblAargau[[#This Row],[2001-2011]],tblAargau[2001-2011])","v":206},0.42307692307692313,{"$f":"_xlfn.RANK.EQ(tblAargau[[#This Row],[1981-2011]],tblAargau[1981-2011])","v":105},4.25,{"$f":"_xlfn.RANK.EQ(tblAargau[[#This Row],[Fläche in km²]],tblAargau[Fläche in km²])","v":145},131,{"$f":"_xlfn.RANK.EQ(tblAargau[[#This Row],[Einwohner/km²]],tblAargau[Einwohner/km²])","v":186},114,{"$f":"_xlfn.RANK.EQ(tblAargau[[#This Row],[Tax]],tblAargau[Tax],1)","v":144}]
["Biberstein","Aarau",932,966,1041,1055,1063,1095,1095,1095,1076,1091,1025,1033,1027,1024,1028,1025,1044,1029,1033,1069,1107,1100,1125,1211,1231,1256,1296,1327,1368,1397,1447,{"$f":"_xlfn.RANK.EQ(tblAargau[[#This Row],[2011]],tblAargau[2011])","v":120},0.17060085836909877,4.2926829268292721E-2,0.30713640469738035,{"$f":"_xlfn.RANK.EQ(tblAargau[[#This Row],[2001-2011]],tblAargau[2001-2011])","v":14},0.55257510729613735,{"$f":"_xlfn.RANK.EQ(tblAargau[[#This Row],[1981-2011]],tblAargau[1981-2011])","v":77},4.1100000000000003,{"$f":"_xlfn.RANK.EQ(tblAargau[[#This Row],[Fläche in km²]],tblAargau[Fläche in km²])","v":149},352,{"$f":"_xlfn.RANK.EQ(tblAargau[[#This Row],[Einwohner/km²]],tblAargau[Einwohner/km²])","v":100},88,{"$f":"_xlfn.RANK.EQ(tblAargau[[#This Row],[Tax]],tblAargau[Tax],1)","v":16}]
["Birmenstorf (AG)","Baden",1427,1455,1498,1504,1626,1667,1729,1798,1834,1859,2020,2030,2036,2100,2121,2175,2249,2277,2263,2280,2285,2292,2308,2353,2343,2388,2409,2461,2498,2569,2648,{"$f":"_xlfn.RANK.EQ(tblAargau[[#This Row],[2011]],tblAargau[2011])","v":76},0.30273300630693756,0.12871287128712861,0.15886214442013125,{"$f":"_xlfn.RANK.EQ(tblAargau[[#This Row],[2001-2011]],tblAargau[2001-2011])","v":67},0.85564120532585841,{"$f":"_xlfn.RANK.EQ(tblAargau[[#This Row],[1981-2011]],tblAargau[1981-2011])","v":32},7.79,{"$f":"_xlfn.RANK.EQ(tblAargau[[#This Row],[Fläche in km²]],tblAargau[Fläche in km²])","v":63},340,{"$f":"_xlfn.RANK.EQ(tblAargau[[#This Row],[Einwohner/km²]],tblAargau[Einwohner/km²])","v":102},99,{"$f":"_xlfn.RANK.EQ(tblAargau[[#This Row],[Tax]],tblAargau[Tax],1)","v":53}]
["Birr","Brugg",2978,3008,3015,3029,3028,3124,3193,3259,3351,3353,3327,3277,3298,3320,3332,3274,3291,3257,3357,3453,3585,3689,3757,3736,3762,3795,3908,4045,4068,4117,4202,{"$f":"_xlfn.RANK.EQ(tblAargau[[#This Row],[2011]],tblAargau[2011])","v":43},0.12592343854936194,3.7871956717763666E-2,0.17210599721059983,{"$f":"_xlfn.RANK.EQ(tblAargau[[#This Row],[2001-2011]],tblAargau[2001-2011])","v":60},0.41101410342511757,{"$f":"_xlfn.RANK.EQ(tblAargau[[#This Row],[1981-2011]],tblAargau[1981-2011])","v":110},5.05,{"$f":"_xlfn.RANK.EQ(tblAargau[[#This Row],[Fläche in km²]],tblAargau[Fläche in km²])","v":120},832,{"$f":"_xlfn.RANK.EQ(tblAargau[[#This Row],[Einwohner/km²]],tblAargau[Einwohner/km²])","v":37},110,{"$f":"_xlfn.RANK.EQ(tblAargau[[#This Row],[Tax]],tblAargau[Tax],1)","v":117}]
["Birrhard","Brugg",469,492,496,493,504,514,503,507,523,544,538,569,582,601,607,601,634,664,660,663,673,674,677,658,632,640,642,642,643,631,638,{"$f":"_xlfn.RANK.EQ(tblAargau[[#This Row],[2011]],tblAargau[2011])","v":190},0.15991471215351805,0.23234200743494426,-5.2005943536404198E-2,{"$f":"_xlfn.RANK.EQ(tblAargau[[#This Row],[2001-2011]],tblAargau[2001-2011])","v":211},0.36034115138592759,{"$f":"_xlfn.RANK.EQ(tblAargau[[#This Row],[1981-2011]],tblAargau[1981-2011])","v":132},2.99,{"$f":"_xlfn.RANK.EQ(tblAargau[[#This Row],[Fläche in km²]],tblAargau[Fläche in km²])","v":186},213,{"$f":"_xlfn.RANK.EQ(tblAargau[[#This Row],[Einwohner/km²]],tblAargau[Einwohner/km²])","v":142},118,{"$f":"_xlfn.RANK.EQ(tblAargau[[#This Row],[Tax]],tblAargau[Tax],1)","v":178}]
["Birrwil","Kulm",979,963,955,937,940,950,949,945,929,943,916,937,925,948,928,942,978,990,988,970,964,941,942,941,913,929,934,931,957,946,975,{"$f":"_xlfn.RANK.EQ(tblAargau[[#This Row],[2011]],tblAargau[2011])","v":158},-3.6772216547497405E-2,5.8951965065502154E-2,1.1410788381742698E-2,{"$f":"_xlfn.RANK.EQ(tblAargau[[#This Row],[2001-2011]],tblAargau[2001-2011])","v":189},-4.0858018386108474E-3,{"$f":"_xlfn.RANK.EQ(tblAargau[[#This Row],[1981-2011]],tblAargau[1981-2011])","v":218},3.42,{"$f":"_xlfn.RANK.EQ(tblAargau[[#This Row],[Fläche in km²]],tblAargau[Fläche in km²])","v":169},285,{"$f":"_xlfn.RANK.EQ(tblAargau[[#This Row],[Einwohner/km²]],tblAargau[Einwohner/km²])","v":121},100,{"$f":"_xlfn.RANK.EQ(tblAargau[[#This Row],[Tax]],tblAargau[Tax],1)","v":60}]
["Böbikon","Zurzach",130,124,127,129,128,140,138,135,142,148,176,174,188,187,179,180,181,176,179,181,186,181,179,185,177,184,184,172,171,166,161,{"$f":"_xlfn.RANK.EQ(tblAargau[[#This Row],[2011]],tblAargau[2011])","v":217},0.13846153846153841,2.8409090909090828E-2,-0.13440860215053763,{"$f":"_xlfn.RANK.EQ(tblAargau[[#This Row],[2001-2011]],tblAargau[2001-2011])","v":219},0.2384615384615385,{"$f":"_xlfn.RANK.EQ(tblAargau[[#This Row],[1981-2011]],tblAargau[1981-2011])","v":176},2.59,{"$f":"_xlfn.RANK.EQ(tblAargau[[#This Row],[Fläche in km²]],tblAargau[Fläche in km²])","v":197},62,{"$f":"_xlfn.RANK.EQ(tblAargau[[#This Row],[Einwohner/km²]],tblAargau[Einwohner/km²])","v":215},115,{"$f":"_xlfn.RANK.EQ(tblAargau[[#This Row],[Tax]],tblAargau[Tax],1)","v":150}]
["Boniswil","Lenzburg",975,1001,1014,1010,1014,1008,1000,1054,1075,1099,1127,1132,1186,1235,1271,1244,1271,1309,1306,1346,1336,1350,1349,1371,1405,1415,1368,1388,1380,1404,1426,{"$f":"_xlfn.RANK.EQ(tblAargau[[#This Row],[2011]],tblAargau[2011])","v":121},0.12717948717948713,0.1943212067435669,6.7365269461077792E-2,{"$f":"_xlfn.RANK.EQ(tblAargau[[#This Row],[2001-2011]],tblAargau[2001-2011])","v":148},0.46256410256410252,{"$f":"_xlfn.RANK.EQ(tblAargau[[#This Row],[1981-2011]],tblAargau[1981-2011])","v":93},2.41,{"$f":"_xlfn.RANK.EQ(tblAargau[[#This Row],[Fläche in km²]],tblAargau[Fläche in km²])","v":204},592,{"$f":"_xlfn.RANK.EQ(tblAargau[[#This Row],[Einwohner/km²]],tblAargau[Einwohner/km²])","v":57},100,{"$f":"_xlfn.RANK.EQ(tblAargau[[#This Row],[Tax]],tblAargau[Tax],1)","v":60}]
["Boswil","Muri",1893,1874,1879,1908,1951,1981,1957,1973,2023,2098,2239,2274,2271,2256,2288,2301,2320,2312,2320,2303,2299,2306,2286,2254,2252,2295,2354,2354,2427,2495,2590,{"$f":"_xlfn.RANK.EQ(tblAargau[[#This Row],[2011]],tblAargau[2011])","v":78},0.10829371368198637,2.8584189370254531E-2,0.12657677250978683,{"$f":"_xlfn.RANK.EQ(tblAargau[[#This Row],[2001-2011]],tblAargau[2001-2011])","v":97},0.36819862651875335,{"$f":"_xlfn.RANK.EQ(tblAargau[[#This Row],[1981-2011]],tblAargau[1981-2011])","v":127},11.77,{"$f":"_xlfn.RANK.EQ(tblAargau[[#This Row],[Fläche in km²]],tblAargau[Fläche in km²])","v":22},220,{"$f":"_xlfn.RANK.EQ(tblAargau[[#This Row],[Einwohner/km²]],tblAargau[Einwohner/km²])","v":139},106,{"$f":"_xlfn.RANK.EQ(tblAargau[[#This Row],[Tax]],tblAargau[Tax],1)","v":102}]
["Bottenwil","Zofingen",678,673,677,696,714,699,722,725,733,756,779,775,767,798,789,805,792,798,819,799,808,809,818,803,799,789,795,793,770,790,803,{"$f":"_xlfn.RANK.EQ(tblAargau[[#This Row],[2011]],tblAargau[2011])","v":174},0.11504424778761058,2.5673940949935803E-2,-6.1881188118811936E-3,{"$f":"_xlfn.RANK.EQ(tblAargau[[#This Row],[2001-2011]],tblAargau[2001-2011])","v":198},0.18436578171091456,{"$f":"_xlfn.RANK.EQ(tblAargau[[#This Row],[1981-2011]],tblAargau[1981-2011])","v":191},5.0999999999999996,{"$f":"_xlfn.RANK.EQ(tblAargau[[#This Row],[Fläche in km²]],tblAargau[Fläche in km²])","v":117},157,{"$f":"_xlfn.RANK.EQ(tblAargau[[#This Row],[Einwohner/km²]],tblAargau[Einwohner/km²])","v":173},119,{"$f":"_xlfn.RANK.EQ(tblAargau[[#This Row],[Tax]],tblAargau[Tax],1)","v":189}]
["Böttstein","Zurzach",2949,2987,2954,2936,2962,3061,3154,3265,3372,3427,3507,3612,3649,3671,3676,3682,3687,3676,3688,3641,3661,3710,3712,3683,3741,3705,3726,3736,3695,3660,3715,{"$f":"_xlfn.RANK.EQ(tblAargau[[#This Row],[2011]],tblAargau[2011])","v":52},0.16208884367582232,3.8209295694325629E-2,1.4750068287353146E-2,{"$f":"_xlfn.RANK.EQ(tblAargau[[#This Row],[2001-2011]],tblAargau[2001-2011])","v":186},0.25974906748050186,{"$f":"_xlfn.RANK.EQ(tblAargau[[#This Row],[1981-2011]],tblAargau[1981-2011])","v":168},7.41,{"$f":"_xlfn.RANK.EQ(tblAargau[[#This Row],[Fläche in km²]],tblAargau[Fläche in km²])","v":65},501,{"$f":"_xlfn.RANK.EQ(tblAargau[[#This Row],[Einwohner/km²]],tblAargau[Einwohner/km²])","v":71},110,{"$f":"_xlfn.RANK.EQ(tblAargau[[#This Row],[Tax]],tblAargau[Tax],1)","v":117}]
["Bözen","Brugg",389,406,409,427,442,451,454,451,470,503,554,603,625,618,629,628,653,645,649,646,664,661,640,640,657,670,659,696,719,697,705,{"$f":"_xlfn.RANK.EQ(tblAargau[[#This Row],[2011]],tblAargau[2011])","v":184},0.29305912596401029,0.1660649819494584,6.1746987951807331E-2,{"$f":"_xlfn.RANK.EQ(tblAargau[[#This Row],[2001-2011]],tblAargau[2001-2011])","v":153},0.81233933161953731,{"$f":"_xlfn.RANK.EQ(tblAargau[[#This Row],[1981-2011]],tblAargau[1981-2011])","v":39},3.95,{"$f":"_xlfn.RANK.EQ(tblAargau[[#This Row],[Fläche in km²]],tblAargau[Fläche in km²])","v":153},178,{"$f":"_xlfn.RANK.EQ(tblAargau[[#This Row],[Einwohner/km²]],tblAargau[Einwohner/km²])","v":166},118,{"$f":"_xlfn.RANK.EQ(tblAargau[[#This Row],[Tax]],tblAargau[Tax],1)","v":178}]
["Bremgarten (AG)","Bremgarten",4723,4713,4705,4718,4674,4676,4845,5018,5084,5165,5066,5091,5144,5162,5207,5175,5211,5206,5177,5218,5419,5725,5848,5977,6069,6053,6095,6233,6281,6340,6408,{"$f":"_xlfn.RANK.EQ(tblAargau[[#This Row],[2011]],tblAargau[2011])","v":24},9.3584586068176989E-2,3.0003947887879967E-2,0.18250599741649753,{"$f":"_xlfn.RANK.EQ(tblAargau[[#This Row],[2001-2011]],tblAargau[2001-2011])","v":53},0.35676476815583325,{"$f":"_xlfn.RANK.EQ(tblAargau[[#This Row],[1981-2011]],tblAargau[1981-2011])","v":134},8.02,{"$f":"_xlfn.RANK.EQ(tblAargau[[#This Row],[Fläche in km²]],tblAargau[Fläche in km²])","v":61},799,{"$f":"_xlfn.RANK.EQ(tblAargau[[#This Row],[Einwohner/km²]],tblAargau[Einwohner/km²])","v":40},97,{"$f":"_xlfn.RANK.EQ(tblAargau[[#This Row],[Tax]],tblAargau[Tax],1)","v":41}]
["Brittnau","Zofingen",2833,2801,2808,2810,2898,2896,3031,3024,3077,3080,3172,3220,3306,3348,3362,3400,3475,3457,3479,3523,3572,3564,3594,3621,3644,3620,3632,3641,3647,3647,3692,{"$f":"_xlfn.RANK.EQ(tblAargau[[#This Row],[2011]],tblAargau[2011])","v":54},8.7186727850335322E-2,0.11065573770491799,3.3594624860022293E-2,{"$f":"_xlfn.RANK.EQ(tblAargau[[#This Row],[2001-2011]],tblAargau[2001-2011])","v":173},0.30321214260501228,{"$f":"_xlfn.RANK.EQ(tblAargau[[#This Row],[1981-2011]],tblAargau[1981-2011])","v":154},13.69,{"$f":"_xlfn.RANK.EQ(tblAargau[[#This Row],[Fläche in km²]],tblAargau[Fläche in km²])","v":10},270,{"$f":"_xlfn.RANK.EQ(tblAargau[[#This Row],[Einwohner/km²]],tblAargau[Einwohner/km²])","v":124},121,{"$f":"_xlfn.RANK.EQ(tblAargau[[#This Row],[Tax]],tblAargau[Tax],1)","v":200}]
["Brugg","Brugg",9817,9779,9732,9749,9729,9903,9930,9982,9915,10026,10135,10089,10156,10024,10238,10137,10098,10188,10197,10203,10245,10258,10210,10190,10083,10166,10115,10191,10252,10305,10545,{"$f":"_xlfn.RANK.EQ(tblAargau[[#This Row],[2011]],tblAargau[2011])","v":9},2.1289599674034765E-2,6.7094227923039096E-3,2.9282576866764165E-2,{"$f":"_xlfn.RANK.EQ(tblAargau[[#This Row],[2001-2011]],tblAargau[2001-2011])","v":177},7.4157074462666728E-2,{"$f":"_xlfn.RANK.EQ(tblAargau[[#This Row],[1981-2011]],tblAargau[1981-2011])","v":211},6.36,{"$f":"_xlfn.RANK.EQ(tblAargau[[#This Row],[Fläche in km²]],tblAargau[Fläche in km²])","v":85},1653,{"$f":"_xlfn.RANK.EQ(tblAargau[[#This Row],[Einwohner/km²]],tblAargau[Einwohner/km²])","v":3},95,{"$f":"_xlfn.RANK.EQ(tblAargau[[#This Row],[Tax]],tblAargau[Tax],1)","v":30}]
["Brunegg","Lenzburg",301,310,320,319,311,300,299,305,332,344,365,366,378,392,394,398,427,435,449,465,477,465,471,470,446,483,533,607,630,672,675,{"$f":"_xlfn.RANK.EQ(tblAargau[[#This Row],[2011]],tblAargau[2011])","v":187},0.14285714285714279,0.27397260273972601,0.41509433962264142,{"$f":"_xlfn.RANK.EQ(tblAargau[[#This Row],[2001-2011]],tblAargau[2001-2011])","v":4},1.2425249169435215,{"$f":"_xlfn.RANK.EQ(tblAargau[[#This Row],[1981-2011]],tblAargau[1981-2011])","v":14},1.56,{"$f":"_xlfn.RANK.EQ(tblAargau[[#This Row],[Fläche in km²]],tblAargau[Fläche in km²])","v":213},433,{"$f":"_xlfn.RANK.EQ(tblAargau[[#This Row],[Einwohner/km²]],tblAargau[Einwohner/km²])","v":83},102,{"$f":"_xlfn.RANK.EQ(tblAargau[[#This Row],[Tax]],tblAargau[Tax],1)","v":75}]
["Buchs (AG)","Aarau",5845,5799,5749,5675,5689,5717,5676,5700,5636,5639,5832,5844,5883,5867,5944,6000,5980,5952,6054,6150,6114,6190,6297,6311,6281,6243,6199,6478,6677,6969,7224,{"$f":"_xlfn.RANK.EQ(tblAargau[[#This Row],[2011]],tblAargau[2011])","v":18},-3.5243798118049563E-2,5.4526748971193362E-2,0.18155053974484781,{"$f":"_xlfn.RANK.EQ(tblAargau[[#This Row],[2001-2011]],tblAargau[2001-2011])","v":56},0.23592814371257487,{"$f":"_xlfn.RANK.EQ(tblAargau[[#This Row],[1981-2011]],tblAargau[1981-2011])","v":177},5.33,{"$f":"_xlfn.RANK.EQ(tblAargau[[#This Row],[Fläche in km²]],tblAargau[Fläche in km²])","v":114},1355,{"$f":"_xlfn.RANK.EQ(tblAargau[[#This Row],[Einwohner/km²]],tblAargau[Einwohner/km²])","v":11},97,{"$f":"_xlfn.RANK.EQ(tblAargau[[#This Row],[Tax]],tblAargau[Tax],1)","v":41}]
["Bünzen","Muri",676,685,719,711,724,746,773,782,814,830,841,854,850,875,888,909,909,892,868,868,874,882,890,938,942,946,946,963,965,1004,1037,{"$f":"_xlfn.RANK.EQ(tblAargau[[#This Row],[2011]],tblAargau[2011])","v":148},0.22781065088757391,3.2104637336504149E-2,0.18649885583524028,{"$f":"_xlfn.RANK.EQ(tblAargau[[#This Row],[2001-2011]],tblAargau[2001-2011])","v":49},0.53402366863905315,{"$f":"_xlfn.RANK.EQ(tblAargau[[#This Row],[1981-2011]],tblAargau[1981-2011])","v":80},5.77,{"$f":"_xlfn.RANK.EQ(tblAargau[[#This Row],[Fläche in km²]],tblAargau[Fläche in km²])","v":100},180,{"$f":"_xlfn.RANK.EQ(tblAargau[[#This Row],[Einwohner/km²]],tblAargau[Einwohner/km²])","v":164},113,{"$f":"_xlfn.RANK.EQ(tblAargau[[#This Row],[Tax]],tblAargau[Tax],1)","v":139}]
["Burg (AG)","Kulm",968,953,952,944,943,980,997,1050,1104,1096,1129,1123,1150,1141,1154,1114,1087,1081,1056,995,984,944,961,1001,969,979,997,1006,989,987,996,{"$f":"_xlfn.RANK.EQ(tblAargau[[#This Row],[2011]],tblAargau[2011])","v":154},0.13223140495867769,-0.11868910540301147,1.2195121951219523E-2,{"$f":"_xlfn.RANK.EQ(tblAargau[[#This Row],[2001-2011]],tblAargau[2001-2011])","v":188},2.8925619834710758E-2,{"$f":"_xlfn.RANK.EQ(tblAargau[[#This Row],[1981-2011]],tblAargau[1981-2011])","v":214},0.94,{"$f":"_xlfn.RANK.EQ(tblAargau[[#This Row],[Fläche in km²]],tblAargau[Fläche in km²])","v":218},1060,{"$f":"_xlfn.RANK.EQ(tblAargau[[#This Row],[Einwohner/km²]],tblAargau[Einwohner/km²])","v":21},119,{"$f":"_xlfn.RANK.EQ(tblAargau[[#This Row],[Tax]],tblAargau[Tax],1)","v":189}]
["Büttikon","Bremgarten",503,513,525,522,525,570,576,590,614,625,629,647,652,656,659,659,640,654,669,662,688,686,731,737,745,801,803,834,903,921,943,{"$f":"_xlfn.RANK.EQ(tblAargau[[#This Row],[2011]],tblAargau[2011])","v":161},0.24254473161033796,5.246422893481717E-2,0.37063953488372103,{"$f":"_xlfn.RANK.EQ(tblAargau[[#This Row],[2001-2011]],tblAargau[2001-2011])","v":6},0.874751491053678,{"$f":"_xlfn.RANK.EQ(tblAargau[[#This Row],[1981-2011]],tblAargau[1981-2011])","v":31},2.82,{"$f":"_xlfn.RANK.EQ(tblAargau[[#This Row],[Fläche in km²]],tblAargau[Fläche in km²])","v":191},334,{"$f":"_xlfn.RANK.EQ(tblAargau[[#This Row],[Einwohner/km²]],tblAargau[Einwohner/km²])","v":106},99,{"$f":"_xlfn.RANK.EQ(tblAargau[[#This Row],[Tax]],tblAargau[Tax],1)","v":53}]
["Buttwil","Muri",603,658,680,692,710,739,742,779,849,875,904,951,938,960,1057,1070,1095,1101,1112,1118,1121,1108,1135,1150,1161,1155,1160,1170,1171,1160,1170,{"$f":"_xlfn.RANK.EQ(tblAargau[[#This Row],[2011]],tblAargau[2011])","v":140},0.45107794361525699,0.23672566371681425,4.3710972346119537E-2,{"$f":"_xlfn.RANK.EQ(tblAargau[[#This Row],[2001-2011]],tblAargau[2001-2011])","v":168},0.94029850746268662,{"$f":"_xlfn.RANK.EQ(tblAargau[[#This Row],[1981-2011]],tblAargau[1981-2011])","v":28},4.5199999999999996,{"$f":"_xlfn.RANK.EQ(tblAargau[[#This Row],[Fläche in km²]],tblAargau[Fläche in km²])","v":134},259,{"$f":"_xlfn.RANK.EQ(tblAargau[[#This Row],[Einwohner/km²]],tblAargau[Einwohner/km²])","v":128},102,{"$f":"_xlfn.RANK.EQ(tblAargau[[#This Row],[Tax]],tblAargau[Tax],1)","v":75}]
["Densbüren","Aarau",596,589,591,614,599,610,612,634,652,684,714,750,754,757,755,774,756,768,751,737,732,725,734,742,741,737,719,710,733,705,693,{"$f":"_xlfn.RANK.EQ(tblAargau[[#This Row],[2011]],tblAargau[2011])","v":185},0.1476510067114094,3.2212885154061732E-2,-5.3278688524590168E-2,{"$f":"_xlfn.RANK.EQ(tblAargau[[#This Row],[2001-2011]],tblAargau[2001-2011])","v":213},0.16275167785234901,{"$f":"_xlfn.RANK.EQ(tblAargau[[#This Row],[1981-2011]],tblAargau[1981-2011])","v":195},12.51,{"$f":"_xlfn.RANK.EQ(tblAargau[[#This Row],[Fläche in km²]],tblAargau[Fläche in km²])","v":15},55,{"$f":"_xlfn.RANK.EQ(tblAargau[[#This Row],[Einwohner/km²]],tblAargau[Einwohner/km²])","v":218},119,{"$f":"_xlfn.RANK.EQ(tblAargau[[#This Row],[Tax]],tblAargau[Tax],1)","v":189}]
["Dietwil","Muri",618,619,616,611,674,703,731,730,753,816,885,894,895,920,987,979,991,998,1008,1012,1046,1036,1002,1007,1027,1016,1062,1136,1178,1212,1244,{"$f":"_xlfn.RANK.EQ(tblAargau[[#This Row],[2011]],tblAargau[2011])","v":135},0.32038834951456319,0.14350282485875709,0.1892925430210326,{"$f":"_xlfn.RANK.EQ(tblAargau[[#This Row],[2001-2011]],tblAargau[2001-2011])","v":44},1.0129449838187701,{"$f":"_xlfn.RANK.EQ(tblAargau[[#This Row],[1981-2011]],tblAargau[1981-2011])","v":23},5.5,{"$f":"_xlfn.RANK.EQ(tblAargau[[#This Row],[Fläche in km²]],tblAargau[Fläche in km²])","v":108},226,{"$f":"_xlfn.RANK.EQ(tblAargau[[#This Row],[Einwohner/km²]],tblAargau[Einwohner/km²])","v":136},116,{"$f":"_xlfn.RANK.EQ(tblAargau[[#This Row],[Tax]],tblAargau[Tax],1)","v":164}]
["Dintikon","Lenzburg",850,872,888,917,926,965,993,1005,1014,1035,1074,1061,1144,1201,1203,1204,1251,1273,1288,1316,1321,1348,1359,1357,1389,1393,1613,1777,1927,1943,2016,{"$f":"_xlfn.RANK.EQ(tblAargau[[#This Row],[2011]],tblAargau[2011])","v":97},0.2176470588235293,0.22532588454376157,0.52611657834973502,{"$f":"_xlfn.RANK.EQ(tblAargau[[#This Row],[2001-2011]],tblAargau[2001-2011])","v":1},1.3717647058823528,{"$f":"_xlfn.RANK.EQ(tblAargau[[#This Row],[1981-2011]],tblAargau[1981-2011])","v":9},3.73,{"$f":"_xlfn.RANK.EQ(tblAargau[[#This Row],[Fläche in km²]],tblAargau[Fläche in km²])","v":162},540,{"$f":"_xlfn.RANK.EQ(tblAargau[[#This Row],[Einwohner/km²]],tblAargau[Einwohner/km²])","v":64},95,{"$f":"_xlfn.RANK.EQ(tblAargau[[#This Row],[Tax]],tblAargau[Tax],1)","v":30}]
["Dottikon","Bremgarten",2612,2704,2706,2733,2722,2775,2854,2882,2906,2928,2985,3027,3093,3107,3072,3068,3039,3013,2989,3001,3035,3079,3085,3073,3042,3086,3072,3094,3118,3260,3397,{"$f":"_xlfn.RANK.EQ(tblAargau[[#This Row],[2011]],tblAargau[2011])","v":61},0.12098009188361414,5.3601340033500033E-3,0.11927512355848435,{"$f":"_xlfn.RANK.EQ(tblAargau[[#This Row],[2001-2011]],tblAargau[2001-2011])","v":107},0.30053598774885137,{"$f":"_xlfn.RANK.EQ(tblAargau[[#This Row],[1981-2011]],tblAargau[1981-2011])","v":156},3.88,{"$f":"_xlfn.RANK.EQ(tblAargau[[#This Row],[Fläche in km²]],tblAargau[Fläche in km²])","v":157},876,{"$f":"_xlfn.RANK.EQ(tblAargau[[#This Row],[Einwohner/km²]],tblAargau[Einwohner/km²])","v":32},90,{"$f":"_xlfn.RANK.EQ(tblAargau[[#This Row],[Tax]],tblAargau[Tax],1)","v":22}]
["Döttingen","Zurzach",3193,3157,3116,3049,3009,3049,3031,3035,3029,3131,3263,3261,3336,3347,3324,3303,3293,3230,3231,3224,3254,3319,3376,3394,3376,3386,3472,3592,3695,3731,3724,{"$f":"_xlfn.RANK.EQ(tblAargau[[#This Row],[2011]],tblAargau[2011])","v":51},-1.9417475728155331E-2,-1.195219123505975E-2,0.14443761524277821,{"$f":"_xlfn.RANK.EQ(tblAargau[[#This Row],[2001-2011]],tblAargau[2001-2011])","v":82},0.1663012840588789,{"$f":"_xlfn.RANK.EQ(tblAargau[[#This Row],[1981-2011]],tblAargau[1981-2011])","v":194},6.92,{"$f":"_xlfn.RANK.EQ(tblAargau[[#This Row],[Fläche in km²]],tblAargau[Fläche in km²])","v":77},538,{"$f":"_xlfn.RANK.EQ(tblAargau[[#This Row],[Einwohner/km²]],tblAargau[Einwohner/km²])","v":65},60,{"$f":"_xlfn.RANK.EQ(tblAargau[[#This Row],[Tax]],tblAargau[Tax],1)","v":1}]
["Dürrenäsch","Kulm",982,1004,1030,1035,1033,1028,1029,1016,1020,1024,1047,1066,1086,1089,1134,1121,1127,1106,1096,1098,1102,1109,1112,1141,1125,1118,1112,1129,1150,1137,1176,{"$f":"_xlfn.RANK.EQ(tblAargau[[#This Row],[2011]],tblAargau[2011])","v":139},4.2769857433808456E-2,4.871060171919761E-2,6.7150635208711451E-2,{"$f":"_xlfn.RANK.EQ(tblAargau[[#This Row],[2001-2011]],tblAargau[2001-2011])","v":149},0.19755600814663943,{"$f":"_xlfn.RANK.EQ(tblAargau[[#This Row],[1981-2011]],tblAargau[1981-2011])","v":187},5.91,{"$f":"_xlfn.RANK.EQ(tblAargau[[#This Row],[Fläche in km²]],tblAargau[Fläche in km²])","v":96},199,{"$f":"_xlfn.RANK.EQ(tblAargau[[#This Row],[Einwohner/km²]],tblAargau[Einwohner/km²])","v":154},85,{"$f":"_xlfn.RANK.EQ(tblAargau[[#This Row],[Tax]],tblAargau[Tax],1)","v":10}]
["Effingen","Brugg",423,442,458,459,471,462,492,509,538,578,561,580,589,611,619,626,617,586,600,601,606,597,590,599,614,620,613,610,587,589,601,{"$f":"_xlfn.RANK.EQ(tblAargau[[#This Row],[2011]],tblAargau[2011])","v":192},0.3664302600472813,7.1301247771835996E-2,-8.2508250825082952E-3,{"$f":"_xlfn.RANK.EQ(tblAargau[[#This Row],[2001-2011]],tblAargau[2001-2011])","v":199},0.42080378250591011,{"$f":"_xlfn.RANK.EQ(tblAargau[[#This Row],[1981-2011]],tblAargau[1981-2011])","v":106},6.85,{"$f":"_xlfn.RANK.EQ(tblAargau[[#This Row],[Fläche in km²]],tblAargau[Fläche in km²])","v":79},88,{"$f":"_xlfn.RANK.EQ(tblAargau[[#This Row],[Einwohner/km²]],tblAargau[Einwohner/km²])","v":207},121,{"$f":"_xlfn.RANK.EQ(tblAargau[[#This Row],[Tax]],tblAargau[Tax],1)","v":200}]
["Eggenwil","Bremgarten",428,454,444,517,565,540,570,591,599,590,591,597,591,586,596,624,628,656,651,664,660,694,697,711,711,749,755,803,823,875,890,{"$f":"_xlfn.RANK.EQ(tblAargau[[#This Row],[2011]],tblAargau[2011])","v":165},0.37850467289719636,0.12351945854483914,0.3484848484848484,{"$f":"_xlfn.RANK.EQ(tblAargau[[#This Row],[2001-2011]],tblAargau[2001-2011])","v":10},1.0794392523364484,{"$f":"_xlfn.RANK.EQ(tblAargau[[#This Row],[1981-2011]],tblAargau[1981-2011])","v":19},2.46,{"$f":"_xlfn.RANK.EQ(tblAargau[[#This Row],[Fläche in km²]],tblAargau[Fläche in km²])","v":200},362,{"$f":"_xlfn.RANK.EQ(tblAargau[[#This Row],[Einwohner/km²]],tblAargau[Einwohner/km²])","v":99},98,{"$f":"_xlfn.RANK.EQ(tblAargau[[#This Row],[Tax]],tblAargau[Tax],1)","v":44}]
["Egliswil","Lenzburg",729,745,749,754,811,829,860,854,872,879,910,941,971,1045,1043,1117,1131,1169,1182,1203,1228,1270,1273,1303,1323,1317,1298,1293,1309,1308,1321,{"$f":"_xlfn.RANK.EQ(tblAargau[[#This Row],[2011]],tblAargau[2011])","v":130},0.20576131687242794,0.32197802197802194,7.5732899022801226E-2,{"$f":"_xlfn.RANK.EQ(tblAargau[[#This Row],[2001-2011]],tblAargau[2001-2011])","v":142},0.81207133058984904,{"$f":"_xlfn.RANK.EQ(tblAargau[[#This Row],[1981-2011]],tblAargau[1981-2011])","v":40},6.29,{"$f":"_xlfn.RANK.EQ(tblAargau[[#This Row],[Fläche in km²]],tblAargau[Fläche in km²])","v":87},210,{"$f":"_xlfn.RANK.EQ(tblAargau[[#This Row],[Einwohner/km²]],tblAargau[Einwohner/km²])","v":146},110,{"$f":"_xlfn.RANK.EQ(tblAargau[[#This Row],[Tax]],tblAargau[Tax],1)","v":117}]
["Ehrendingen","Baden",2538,2589,2617,2647,2657,2703,2701,2827,2858,2875,2977,2969,3013,2965,3033,3086,3188,3267,3292,3300,3309,3423,3579,3671,3760,3809,3864,3956,4117,4152,4243,{"$f":"_xlfn.RANK.EQ(tblAargau[[#This Row],[2011]],tblAargau[2011])","v":42},0.13278171788810078,0.10849848841115217,0.28226050166213357,{"$f":"_xlfn.RANK.EQ(tblAargau[[#This Row],[2001-2011]],tblAargau[2001-2011])","v":17},0.67178881008668245,{"$f":"_xlfn.RANK.EQ(tblAargau[[#This Row],[1981-2011]],tblAargau[1981-2011])","v":55},7.29,{"$f":"_xlfn.RANK.EQ(tblAargau[[#This Row],[Fläche in km²]],tblAargau[Fläche in km²])","v":66},582,{"$f":"_xlfn.RANK.EQ(tblAargau[[#This Row],[Einwohner/km²]],tblAargau[Einwohner/km²])","v":58},110,{"$f":"_xlfn.RANK.EQ(tblAargau[[#This Row],[Tax]],tblAargau[Tax],1)","v":117}]
["Eiken","Laufenburg",1061,1053,1071,1071,1119,1168,1209,1292,1303,1376,1450,1483,1538,1538,1563,1608,1670,1713,1746,1745,1774,1831,1821,1848,1899,1929,1950,1993,1979,2001,2103,{"$f":"_xlfn.RANK.EQ(tblAargau[[#This Row],[2011]],tblAargau[2011])","v":92},0.29688972667294999,0.20344827586206904,0.18545659526493807,{"$f":"_xlfn.RANK.EQ(tblAargau[[#This Row],[2001-2011]],tblAargau[2001-2011])","v":50},0.98209236569274272,{"$f":"_xlfn.RANK.EQ(tblAargau[[#This Row],[1981-2011]],tblAargau[1981-2011])","v":26},7.08,{"$f":"_xlfn.RANK.EQ(tblAargau[[#This Row],[Fläche in km²]],tblAargau[Fläche in km²])","v":73},297,{"$f":"_xlfn.RANK.EQ(tblAargau[[#This Row],[Einwohner/km²]],tblAargau[Einwohner/km²])","v":119},114,{"$f":"_xlfn.RANK.EQ(tblAargau[[#This Row],[Tax]],tblAargau[Tax],1)","v":144}]
["Elfingen","Brugg",165,171,173,177,178,174,179,192,213,215,222,220,225,230,243,236,236,237,240,240,244,242,248,245,245,248,262,264,269,260,279,{"$f":"_xlfn.RANK.EQ(tblAargau[[#This Row],[2011]],tblAargau[2011])","v":211},0.30303030303030298,8.1081081081081141E-2,0.14344262295081966,{"$f":"_xlfn.RANK.EQ(tblAargau[[#This Row],[2001-2011]],tblAargau[2001-2011])","v":83},0.69090909090909092,{"$f":"_xlfn.RANK.EQ(tblAargau[[#This Row],[1981-2011]],tblAargau[1981-2011])","v":50},4.2300000000000004,{"$f":"_xlfn.RANK.EQ(tblAargau[[#This Row],[Fläche in km²]],tblAargau[Fläche in km²])","v":146},66,{"$f":"_xlfn.RANK.EQ(tblAargau[[#This Row],[Einwohner/km²]],tblAargau[Einwohner/km²])","v":214},118,{"$f":"_xlfn.RANK.EQ(tblAargau[[#This Row],[Tax]],tblAargau[Tax],1)","v":178}]
["Endingen","Zurzach",1524,1549,1532,1520,1497,1517,1522,1526,1526,1546,1588,1588,1603,1627,1719,1734,1741,1747,1772,1812,1839,1885,1912,1890,1851,1902,1919,1948,1977,1999,2042,{"$f":"_xlfn.RANK.EQ(tblAargau[[#This Row],[2011]],tblAargau[2011])","v":94},1.4435695538057791E-2,0.1410579345088161,0.11038607939097345,{"$f":"_xlfn.RANK.EQ(tblAargau[[#This Row],[2001-2011]],tblAargau[2001-2011])","v":117},0.33989501312335957,{"$f":"_xlfn.RANK.EQ(tblAargau[[#This Row],[1981-2011]],tblAargau[1981-2011])","v":140},8.4600000000000009,{"$f":"_xlfn.RANK.EQ(tblAargau[[#This Row],[Fläche in km²]],tblAargau[Fläche in km²])","v":54},241,{"$f":"_xlfn.RANK.EQ(tblAargau[[#This Row],[Einwohner/km²]],tblAargau[Einwohner/km²])","v":133},114,{"$f":"_xlfn.RANK.EQ(tblAargau[[#This Row],[Tax]],tblAargau[Tax],1)","v":144}]
["Ennetbaden","Baden",2530,2511,2537,2486,2507,2550,2705,2783,2827,2834,2919,3017,3057,2976,2942,2954,2969,2941,2948,2986,3024,3047,3009,2973,2990,2954,2938,3021,3024,3030,3065,{"$f":"_xlfn.RANK.EQ(tblAargau[[#This Row],[2011]],tblAargau[2011])","v":67},0.12015810276679839,2.295306611853376E-2,1.3558201058201158E-2,{"$f":"_xlfn.RANK.EQ(tblAargau[[#This Row],[2001-2011]],tblAargau[2001-2011])","v":187},0.21146245059288526,{"$f":"_xlfn.RANK.EQ(tblAargau[[#This Row],[1981-2011]],tblAargau[1981-2011])","v":183},2.11,{"$f":"_xlfn.RANK.EQ(tblAargau[[#This Row],[Fläche in km²]],tblAargau[Fläche in km²])","v":210},1453,{"$f":"_xlfn.RANK.EQ(tblAargau[[#This Row],[Einwohner/km²]],tblAargau[Einwohner/km²])","v":7},100,{"$f":"_xlfn.RANK.EQ(tblAargau[[#This Row],[Tax]],tblAargau[Tax],1)","v":60}]
["Erlinsbach (AG)","Aarau",3081,3078,3076,3133,3152,3155,3191,3139,3186,3206,3237,3244,3247,3175,3192,3158,3197,3231,3267,3288,3291,3344,3409,3479,3467,3477,3457,3472,3522,3567,3700,{"$f":"_xlfn.RANK.EQ(tblAargau[[#This Row],[2011]],tblAargau[2011])","v":53},4.0571243102888621E-2,1.5755329008340979E-2,0.1242783348526284,{"$f":"_xlfn.RANK.EQ(tblAargau[[#This Row],[2001-2011]],tblAargau[2001-2011])","v":101},0.2009087958455047,{"$f":"_xlfn.RANK.EQ(tblAargau[[#This Row],[1981-2011]],tblAargau[1981-2011])","v":185},9.85,{"$f":"_xlfn.RANK.EQ(tblAargau[[#This Row],[Fläche in km²]],tblAargau[Fläche in km²])","v":36},376,{"$f":"_xlfn.RANK.EQ(tblAargau[[#This Row],[Einwohner/km²]],tblAargau[Einwohner/km²])","v":97},98,{"$f":"_xlfn.RANK.EQ(tblAargau[[#This Row],[Tax]],tblAargau[Tax],1)","v":44}]
["Fahrwangen","Lenzburg",1222,1247,1252,1228,1273,1277,1269,1278,1301,1352,1453,1477,1523,1610,1630,1643,1673,1692,1654,1644,1684,1673,1643,1647,1682,1719,1789,1833,1854,1869,1914,{"$f":"_xlfn.RANK.EQ(tblAargau[[#This Row],[2011]],tblAargau[2011])","v":100},0.1063829787234043,0.13145216792842396,0.13657957244655572,{"$f":"_xlfn.RANK.EQ(tblAargau[[#This Row],[2001-2011]],tblAargau[2001-2011])","v":91},0.5662847790507366,{"$f":"_xlfn.RANK.EQ(tblAargau[[#This Row],[1981-2011]],tblAargau[1981-2011])","v":74},3.99,{"$f":"_xlfn.RANK.EQ(tblAargau[[#This Row],[Fläche in km²]],tblAargau[Fläche in km²])","v":152},480,{"$f":"_xlfn.RANK.EQ(tblAargau[[#This Row],[Einwohner/km²]],tblAargau[Einwohner/km²])","v":75},118,{"$f":"_xlfn.RANK.EQ(tblAargau[[#This Row],[Tax]],tblAargau[Tax],1)","v":178}]
["Fischbach-Göslikon","Bremgarten",686,692,710,734,750,719,770,824,871,927,981,990,1016,1013,1062,1141,1149,1140,1197,1252,1272,1310,1344,1327,1341,1349,1368,1385,1385,1426,1413,{"$f":"_xlfn.RANK.EQ(tblAargau[[#This Row],[2011]],tblAargau[2011])","v":123},0.35131195335276977,0.27624872579001014,0.11084905660377364,{"$f":"_xlfn.RANK.EQ(tblAargau[[#This Row],[2001-2011]],tblAargau[2001-2011])","v":116},1.0597667638483963,{"$f":"_xlfn.RANK.EQ(tblAargau[[#This Row],[1981-2011]],tblAargau[1981-2011])","v":20},3.07,{"$f":"_xlfn.RANK.EQ(tblAargau[[#This Row],[Fläche in km²]],tblAargau[Fläche in km²])","v":185},460,{"$f":"_xlfn.RANK.EQ(tblAargau[[#This Row],[Einwohner/km²]],tblAargau[Einwohner/km²])","v":78},103,{"$f":"_xlfn.RANK.EQ(tblAargau[[#This Row],[Tax]],tblAargau[Tax],1)","v":81}]
["Fisibach","Zurzach",319,327,322,334,340,328,341,358,363,363,367,354,359,370,370,363,347,343,361,361,354,368,377,379,381,379,369,368,355,378,387,{"$f":"_xlfn.RANK.EQ(tblAargau[[#This Row],[2011]],tblAargau[2011])","v":204},0.13793103448275867,-1.6348773841961872E-2,9.3220338983050821E-2,{"$f":"_xlfn.RANK.EQ(tblAargau[[#This Row],[2001-2011]],tblAargau[2001-2011])","v":128},0.21316614420062696,{"$f":"_xlfn.RANK.EQ(tblAargau[[#This Row],[1981-2011]],tblAargau[1981-2011])","v":181},5.79,{"$f":"_xlfn.RANK.EQ(tblAargau[[#This Row],[Fläche in km²]],tblAargau[Fläche in km²])","v":99},67,{"$f":"_xlfn.RANK.EQ(tblAargau[[#This Row],[Einwohner/km²]],tblAargau[Einwohner/km²])","v":213},118,{"$f":"_xlfn.RANK.EQ(tblAargau[[#This Row],[Tax]],tblAargau[Tax],1)","v":178}]
["Fislisbach","Baden",3852,3892,3921,4052,4126,4245,4320,4369,4363,4307,4434,4439,4478,4569,4705,4661,4648,4661,4818,4934,4992,4977,4935,4855,4811,4769,4927,5024,5168,5229,5367,{"$f":"_xlfn.RANK.EQ(tblAargau[[#This Row],[2011]],tblAargau[2011])","v":29},0.11812045690550366,0.11276499774470006,7.5120192307692291E-2,{"$f":"_xlfn.RANK.EQ(tblAargau[[#This Row],[2001-2011]],tblAargau[2001-2011])","v":143},0.39330218068535827,{"$f":"_xlfn.RANK.EQ(tblAargau[[#This Row],[1981-2011]],tblAargau[1981-2011])","v":115},5.0599999999999996,{"$f":"_xlfn.RANK.EQ(tblAargau[[#This Row],[Fläche in km²]],tblAargau[Fläche in km²])","v":119},1061,{"$f":"_xlfn.RANK.EQ(tblAargau[[#This Row],[Einwohner/km²]],tblAargau[Einwohner/km²])","v":20},98,{"$f":"_xlfn.RANK.EQ(tblAargau[[#This Row],[Tax]],tblAargau[Tax],1)","v":44}]
["Freienwil","Baden",505,503,532,615,655,663,649,661,675,644,655,658,661,676,681,682,715,741,742,759,820,817,811,832,834,858,875,874,867,911,932,{"$f":"_xlfn.RANK.EQ(tblAargau[[#This Row],[2011]],tblAargau[2011])","v":163},0.27524752475247527,0.15877862595419856,0.13658536585365844,{"$f":"_xlfn.RANK.EQ(tblAargau[[#This Row],[2001-2011]],tblAargau[2001-2011])","v":90},0.84554455445544563,{"$f":"_xlfn.RANK.EQ(tblAargau[[#This Row],[1981-2011]],tblAargau[1981-2011])","v":36},4,{"$f":"_xlfn.RANK.EQ(tblAargau[[#This Row],[Fläche in km²]],tblAargau[Fläche in km²])","v":151},233,{"$f":"_xlfn.RANK.EQ(tblAargau[[#This Row],[Einwohner/km²]],tblAargau[Einwohner/km²])","v":134},112,{"$f":"_xlfn.RANK.EQ(tblAargau[[#This Row],[Tax]],tblAargau[Tax],1)","v":130}]
["Frick","Laufenburg",3148,3143,3198,3268,3286,3273,3374,3394,3504,3574,3596,3709,3763,3760,3789,3784,3799,3805,3888,3935,4066,4169,4160,4292,4431,4562,4647,4680,4733,4811,4981,{"$f":"_xlfn.RANK.EQ(tblAargau[[#This Row],[2011]],tblAargau[2011])","v":31},0.13532401524777637,9.427141268075645E-2,0.22503689129365467,{"$f":"_xlfn.RANK.EQ(tblAargau[[#This Row],[2001-2011]],tblAargau[2001-2011])","v":29},0.58227445997458704,{"$f":"_xlfn.RANK.EQ(tblAargau[[#This Row],[1981-2011]],tblAargau[1981-2011])","v":67},9.9600000000000009,{"$f":"_xlfn.RANK.EQ(tblAargau[[#This Row],[Fläche in km²]],tblAargau[Fläche in km²])","v":34},500,{"$f":"_xlfn.RANK.EQ(tblAargau[[#This Row],[Einwohner/km²]],tblAargau[Einwohner/km²])","v":72},99,{"$f":"_xlfn.RANK.EQ(tblAargau[[#This Row],[Tax]],tblAargau[Tax],1)","v":53}]
["Full-Reuenthal","Zurzach",668,662,661,668,661,682,679,693,697,713,761,774,772,779,785,790,822,824,830,826,832,823,824,817,823,840,826,813,809,798,808,{"$f":"_xlfn.RANK.EQ(tblAargau[[#This Row],[2011]],tblAargau[2011])","v":173},6.7365269461077792E-2,8.5413929040735859E-2,-2.8846153846153855E-2,{"$f":"_xlfn.RANK.EQ(tblAargau[[#This Row],[2001-2011]],tblAargau[2001-2011])","v":207},0.20958083832335328,{"$f":"_xlfn.RANK.EQ(tblAargau[[#This Row],[1981-2011]],tblAargau[1981-2011])","v":184},4.82,{"$f":"_xlfn.RANK.EQ(tblAargau[[#This Row],[Fläche in km²]],tblAargau[Fläche in km²])","v":128},168,{"$f":"_xlfn.RANK.EQ(tblAargau[[#This Row],[Einwohner/km²]],tblAargau[Einwohner/km²])","v":171},120,{"$f":"_xlfn.RANK.EQ(tblAargau[[#This Row],[Tax]],tblAargau[Tax],1)","v":195}]
["Gallenkirch","Brugg",72,77,79,80,82,82,83,92,100,99,99,99,105,102,101,100,103,116,118,130,125,128,126,128,129,132,135,142,136,133,133,{"$f":"_xlfn.RANK.EQ(tblAargau[[#This Row],[2011]],tblAargau[2011])","v":219},0.375,0.31313131313131315,6.4000000000000057E-2,{"$f":"_xlfn.RANK.EQ(tblAargau[[#This Row],[2001-2011]],tblAargau[2001-2011])","v":151},0.84722222222222232,{"$f":"_xlfn.RANK.EQ(tblAargau[[#This Row],[1981-2011]],tblAargau[1981-2011])","v":35},1.4,{"$f":"_xlfn.RANK.EQ(tblAargau[[#This Row],[Fläche in km²]],tblAargau[Fläche in km²])","v":215},95,{"$f":"_xlfn.RANK.EQ(tblAargau[[#This Row],[Einwohner/km²]],tblAargau[Einwohner/km²])","v":202},100,{"$f":"_xlfn.RANK.EQ(tblAargau[[#This Row],[Tax]],tblAargau[Tax],1)","v":60}]
["Gansingen","Laufenburg",755,757,784,805,803,830,837,857,846,853,907,919,931,913,919,928,953,941,933,932,912,920,933,920,934,939,952,964,952,963,964,{"$f":"_xlfn.RANK.EQ(tblAargau[[#This Row],[2011]],tblAargau[2011])","v":160},0.12980132450331117,2.7563395810363822E-2,5.7017543859649189E-2,{"$f":"_xlfn.RANK.EQ(tblAargau[[#This Row],[2001-2011]],tblAargau[2001-2011])","v":156},0.27682119205298017,{"$f":"_xlfn.RANK.EQ(tblAargau[[#This Row],[1981-2011]],tblAargau[1981-2011])","v":163},8.77,{"$f":"_xlfn.RANK.EQ(tblAargau[[#This Row],[Fläche in km²]],tblAargau[Fläche in km²])","v":49},110,{"$f":"_xlfn.RANK.EQ(tblAargau[[#This Row],[Einwohner/km²]],tblAargau[Einwohner/km²])","v":194},117,{"$f":"_xlfn.RANK.EQ(tblAargau[[#This Row],[Tax]],tblAargau[Tax],1)","v":168}]
["Gebenstorf","Baden",3637,3698,3788,3878,3880,3942,3991,3990,3992,4009,4079,4130,4164,4175,4202,4159,4195,4154,4173,4169,4189,4173,4264,4389,4412,4448,4439,4548,4564,4639,4692,{"$f":"_xlfn.RANK.EQ(tblAargau[[#This Row],[2011]],tblAargau[2011])","v":33},0.10228210063238929,2.206423142927183E-2,0.12007639054666974,{"$f":"_xlfn.RANK.EQ(tblAargau[[#This Row],[2001-2011]],tblAargau[2001-2011])","v":104},0.29007423700852342,{"$f":"_xlfn.RANK.EQ(tblAargau[[#This Row],[1981-2011]],tblAargau[1981-2011])","v":158},5.65,{"$f":"_xlfn.RANK.EQ(tblAargau[[#This Row],[Fläche in km²]],tblAargau[Fläche in km²])","v":104},830,{"$f":"_xlfn.RANK.EQ(tblAargau[[#This Row],[Einwohner/km²]],tblAargau[Einwohner/km²])","v":38},103,{"$f":"_xlfn.RANK.EQ(tblAargau[[#This Row],[Tax]],tblAargau[Tax],1)","v":81}]
["Geltwil","Muri",131,131,134,137,147,155,152,152,147,148,159,159,157,156,151,153,152,148,145,142,155,160,155,155,150,174,189,187,194,184,187,{"$f":"_xlfn.RANK.EQ(tblAargau[[#This Row],[2011]],tblAargau[2011])","v":215},{"$f":"IFERROR(L66/C66-1,0)","v":0.12977099236641232},{"$f":"IFERROR(V66/M66-1,0)","v":-0.10691823899371067},{"$f":"IFERROR(AG66/W66-1,0)","v":0.20645161290322589},{"$f":"_xlfn.RANK.EQ(tblAargau[[#This Row],[2001-2011]],tblAargau[2001-2011])","v":35},{"$f":"IFERROR(AG66/C66-1,0)","v":0.4274809160305344},{"$f":"_xlfn.RANK.EQ(tblAargau[[#This Row],[1981-2011]],tblAargau[1981-2011])","v":103},3.3,{"$f":"_xlfn.RANK.EQ(tblAargau[[#This Row],[Fläche in km²]],tblAargau[Fläche in km²])","v":174},57,{"$f":"_xlfn.RANK.EQ(tblAargau[[#This Row],[Einwohner/km²]],tblAargau[Einwohner/km²])","v":216},90,{"$f":"_xlfn.RANK.EQ(tblAargau[[#This Row],[Tax]],tblAargau[Tax],1)","v":22}]
["Gipf-Oberfrick","Laufenburg",1488,1552,1594,1652,1736,1798,1833,1863,1933,2008,2105,2175,2301,2436,2500,2558,2599,2726,2792,2862,2885,2958,2988,2993,3081,3104,3166,3170,3201,3244,3279,{"$f":"_xlfn.RANK.EQ(tblAargau[[#This Row],[2011]],tblAargau[2011])","v":62},0.34946236559139776,0.35961995249406176,0.13656845753899471,{"$f":"_xlfn.RANK.EQ(tblAargau[[#This Row],[2001-2011]],tblAargau[2001-2011])","v":92},1.2036290322580645,{"$f":"_xlfn.RANK.EQ(tblAargau[[#This Row],[1981-2011]],tblAargau[1981-2011])","v":16},10.18,{"$f":"_xlfn.RANK.EQ(tblAargau[[#This Row],[Fläche in km²]],tblAargau[Fläche in km²])","v":32},322,{"$f":"_xlfn.RANK.EQ(tblAargau[[#This Row],[Einwohner/km²]],tblAargau[Einwohner/km²])","v":111},102,{"$f":"_xlfn.RANK.EQ(tblAargau[[#This Row],[Tax]],tblAargau[Tax],1)","v":75}]
["Gontenschwil","Kulm",2036,2010,2035,2043,2040,2036,2007,1984,2013,2027,2137,2170,2132,2114,2124,2062,2079,2086,2119,2076,2121,2099,2110,2077,2062,2088,2071,2097,2072,2063,2059,{"$f":"_xlfn.RANK.EQ(tblAargau[[#This Row],[2011]],tblAargau[2011])","v":93},-4.4204322200392943E-3,-2.8544688816097286E-2,-2.9231494578029205E-2,{"$f":"_xlfn.RANK.EQ(tblAargau[[#This Row],[2001-2011]],tblAargau[2001-2011])","v":208},1.129666011787811E-2,{"$f":"_xlfn.RANK.EQ(tblAargau[[#This Row],[1981-2011]],tblAargau[1981-2011])","v":215},9.74,{"$f":"_xlfn.RANK.EQ(tblAargau[[#This Row],[Fläche in km²]],tblAargau[Fläche in km²])","v":37},211,{"$f":"_xlfn.RANK.EQ(tblAargau[[#This Row],[Einwohner/km²]],tblAargau[Einwohner/km²])","v":145},112,{"$f":"_xlfn.RANK.EQ(tblAargau[[#This Row],[Tax]],tblAargau[Tax],1)","v":130}]
["Gränichen","Aarau",5329,5299,5285,5323,5367,5438,5439,5566,5665,5742,5737,5807,5905,5957,5962,5987,6005,6047,6072,6093,6164,6239,6303,6335,6327,6443,6414,6404,6496,6672,6873,{"$f":"_xlfn.RANK.EQ(tblAargau[[#This Row],[2011]],tblAargau[2011])","v":21},7.7500469131169147E-2,6.2053337981523349E-2,0.11502271252433482,{"$f":"_xlfn.RANK.EQ(tblAargau[[#This Row],[2001-2011]],tblAargau[2001-2011])","v":114},0.28973541002064174,{"$f":"_xlfn.RANK.EQ(tblAargau[[#This Row],[1981-2011]],tblAargau[1981-2011])","v":159},17.239999999999998,{"$f":"_xlfn.RANK.EQ(tblAargau[[#This Row],[Fläche in km²]],tblAargau[Fläche in km²])","v":6},399,{"$f":"_xlfn.RANK.EQ(tblAargau[[#This Row],[Einwohner/km²]],tblAargau[Einwohner/km²])","v":92},111,{"$f":"_xlfn.RANK.EQ(tblAargau[[#This Row],[Tax]],tblAargau[Tax],1)","v":128}]
["Habsburg","Brugg",253,255,257,272,276,283,287,300,313,315,331,340,353,357,372,384,384,394,378,370,357,378,388,399,400,390,410,437,433,424,420,{"$f":"_xlfn.RANK.EQ(tblAargau[[#This Row],[2011]],tblAargau[2011])","v":201},0.24505928853754932,0.1178247734138973,0.17647058823529416,{"$f":"_xlfn.RANK.EQ(tblAargau[[#This Row],[2001-2011]],tblAargau[2001-2011])","v":59},0.66007905138339917,{"$f":"_xlfn.RANK.EQ(tblAargau[[#This Row],[1981-2011]],tblAargau[1981-2011])","v":57},2.23,{"$f":"_xlfn.RANK.EQ(tblAargau[[#This Row],[Fläche in km²]],tblAargau[Fläche in km²])","v":207},188,{"$f":"_xlfn.RANK.EQ(tblAargau[[#This Row],[Einwohner/km²]],tblAargau[Einwohner/km²])","v":159},88,{"$f":"_xlfn.RANK.EQ(tblAargau[[#This Row],[Tax]],tblAargau[Tax],1)","v":16}]
["Hägglingen","Bremgarten",1679,1708,1731,1766,1764,1804,1800,1801,1798,1819,1865,1907,1952,1968,1960,1967,1980,1983,1961,2005,1965,1977,2025,2051,2056,2079,2141,2167,2201,2260,2346,{"$f":"_xlfn.RANK.EQ(tblAargau[[#This Row],[2011]],tblAargau[2011])","v":87},8.3382966051220864E-2,7.5067024128686377E-2,0.19389312977099227,{"$f":"_xlfn.RANK.EQ(tblAargau[[#This Row],[2001-2011]],tblAargau[2001-2011])","v":43},0.39726027397260277,{"$f":"_xlfn.RANK.EQ(tblAargau[[#This Row],[1981-2011]],tblAargau[1981-2011])","v":114},7.75,{"$f":"_xlfn.RANK.EQ(tblAargau[[#This Row],[Fläche in km²]],tblAargau[Fläche in km²])","v":64},303,{"$f":"_xlfn.RANK.EQ(tblAargau[[#This Row],[Einwohner/km²]],tblAargau[Einwohner/km²])","v":117},95,{"$f":"_xlfn.RANK.EQ(tblAargau[[#This Row],[Tax]],tblAargau[Tax],1)","v":30}]
["Hallwil","Lenzburg",516,539,533,527,539,564,568,574,602,624,676,658,669,709,709,719,738,713,713,736,750,754,755,721,711,719,750,731,739,764,770,{"$f":"_xlfn.RANK.EQ(tblAargau[[#This Row],[2011]],tblAargau[2011])","v":178},0.20930232558139528,8.8757396449704151E-2,2.6666666666666616E-2,{"$f":"_xlfn.RANK.EQ(tblAargau[[#This Row],[2001-2011]],tblAargau[2001-2011])","v":178},0.49224806201550386,{"$f":"_xlfn.RANK.EQ(tblAargau[[#This Row],[1981-2011]],tblAargau[1981-2011])","v":88},2.19,{"$f":"_xlfn.RANK.EQ(tblAargau[[#This Row],[Fläche in km²]],tblAargau[Fläche in km²])","v":209},352,{"$f":"_xlfn.RANK.EQ(tblAargau[[#This Row],[Einwohner/km²]],tblAargau[Einwohner/km²])","v":100},117,{"$f":"_xlfn.RANK.EQ(tblAargau[[#This Row],[Tax]],tblAargau[Tax],1)","v":168}]
["Hausen (AG)","Brugg",1648,1729,1780,1837,1878,1884,1884,1881,1870,1847,1917,1962,1989,2075,2147,2353,2408,2489,2554,2538,2554,2570,2614,2623,2699,2725,2777,2876,2864,2939,3009,{"$f":"_xlfn.RANK.EQ(tblAargau[[#This Row],[2011]],tblAargau[2011])","v":68},0.12075242718446599,0.323943661971831,0.17815191855912293,{"$f":"_xlfn.RANK.EQ(tblAargau[[#This Row],[2001-2011]],tblAargau[2001-2011])","v":58},0.82584951456310685,{"$f":"_xlfn.RANK.EQ(tblAargau[[#This Row],[1981-2011]],tblAargau[1981-2011])","v":38},3.21,{"$f":"_xlfn.RANK.EQ(tblAargau[[#This Row],[Fläche in km²]],tblAargau[Fläche in km²])","v":180},937,{"$f":"_xlfn.RANK.EQ(tblAargau[[#This Row],[Einwohner/km²]],tblAargau[Einwohner/km²])","v":28},100,{"$f":"_xlfn.RANK.EQ(tblAargau[[#This Row],[Tax]],tblAargau[Tax],1)","v":60}]
["Hellikon","Rheinfelden",598,607,609,624,634,636,641,642,657,689,728,728,713,751,752,757,765,753,754,752,764,768,778,751,749,753,773,762,772,778,794,{"$f":"_xlfn.RANK.EQ(tblAargau[[#This Row],[2011]],tblAargau[2011])","v":176},0.15217391304347827,3.2967032967033072E-2,3.9267015706806241E-2,{"$f":"_xlfn.RANK.EQ(tblAargau[[#This Row],[2001-2011]],tblAargau[2001-2011])","v":171},0.32775919732441472,{"$f":"_xlfn.RANK.EQ(tblAargau[[#This Row],[1981-2011]],tblAargau[1981-2011])","v":145},7.05,{"$f":"_xlfn.RANK.EQ(tblAargau[[#This Row],[Fläche in km²]],tblAargau[Fläche in km²])","v":74},113,{"$f":"_xlfn.RANK.EQ(tblAargau[[#This Row],[Einwohner/km²]],tblAargau[Einwohner/km²])","v":192},123,{"$f":"_xlfn.RANK.EQ(tblAargau[[#This Row],[Tax]],tblAargau[Tax],1)","v":211}]
["Hendschiken","Lenzburg",726,726,714,697,693,711,711,733,720,731,729,756,786,796,831,857,904,915,915,889,897,885,907,893,902,922,921,923,958,960,1003,{"$f":"_xlfn.RANK.EQ(tblAargau[[#This Row],[2011]],tblAargau[2011])","v":153},6.8870523415978102E-3,0.21947873799725648,0.11817168338907469,{"$f":"_xlfn.RANK.EQ(tblAargau[[#This Row],[2001-2011]],tblAargau[2001-2011])","v":109},0.38154269972451793,{"$f":"_xlfn.RANK.EQ(tblAargau[[#This Row],[1981-2011]],tblAargau[1981-2011])","v":123},3.52,{"$f":"_xlfn.RANK.EQ(tblAargau[[#This Row],[Fläche in km²]],tblAargau[Fläche in km²])","v":166},285,{"$f":"_xlfn.RANK.EQ(tblAargau[[#This Row],[Einwohner/km²]],tblAargau[Einwohner/km²])","v":121},123,{"$f":"_xlfn.RANK.EQ(tblAargau[[#This Row],[Tax]],tblAargau[Tax],1)","v":211}]
["Hermetschwil-Staffeln","Bremgarten",507,527,547,550,548,571,584,593,597,620,622,672,702,750,880,962,967,987,1043,1061,1079,1084,1125,1109,1089,1066,1087,1096,1088,1092,1129,{"$f":"_xlfn.RANK.EQ(tblAargau[[#This Row],[2011]],tblAargau[2011])","v":143},0.22287968441814598,0.70578778135048226,4.6339202965709037E-2,{"$f":"_xlfn.RANK.EQ(tblAargau[[#This Row],[2001-2011]],tblAargau[2001-2011])","v":162},1.2268244575936884,{"$f":"_xlfn.RANK.EQ(tblAargau[[#This Row],[1981-2011]],tblAargau[1981-2011])","v":15},3.34,{"$f":"_xlfn.RANK.EQ(tblAargau[[#This Row],[Fläche in km²]],tblAargau[Fläche in km²])","v":172},338,{"$f":"_xlfn.RANK.EQ(tblAargau[[#This Row],[Einwohner/km²]],tblAargau[Einwohner/km²])","v":103},112,{"$f":"_xlfn.RANK.EQ(tblAargau[[#This Row],[Tax]],tblAargau[Tax],1)","v":130}]
["Herznach","Laufenburg",756,767,787,797,826,837,876,909,936,972,1033,1026,1033,1044,1060,1058,1063,1059,1098,1070,1092,1104,1110,1173,1202,1221,1277,1286,1288,1324,1343,{"$f":"_xlfn.RANK.EQ(tblAargau[[#This Row],[2011]],tblAargau[2011])","v":127},0.28571428571428581,3.5818005808325282E-2,0.22985347985347993,{"$f":"_xlfn.RANK.EQ(tblAargau[[#This Row],[2001-2011]],tblAargau[2001-2011])","v":27},0.77645502645502651,{"$f":"_xlfn.RANK.EQ(tblAargau[[#This Row],[1981-2011]],tblAargau[1981-2011])","v":43},6.28,{"$f":"_xlfn.RANK.EQ(tblAargau[[#This Row],[Fläche in km²]],tblAargau[Fläche in km²])","v":88},214,{"$f":"_xlfn.RANK.EQ(tblAargau[[#This Row],[Einwohner/km²]],tblAargau[Einwohner/km²])","v":141},119,{"$f":"_xlfn.RANK.EQ(tblAargau[[#This Row],[Tax]],tblAargau[Tax],1)","v":189}]
["Hirschthal","Aarau",947,995,1009,1019,1020,1052,1059,1079,1080,1082,1112,1105,1133,1141,1119,1119,1137,1134,1152,1204,1189,1211,1206,1271,1301,1330,1367,1411,1421,1436,1485,{"$f":"_xlfn.RANK.EQ(tblAargau[[#This Row],[2011]],tblAargau[2011])","v":116},0.14255543822597683,8.2733812949640217E-2,0.24894869638351547,{"$f":"_xlfn.RANK.EQ(tblAargau[[#This Row],[2001-2011]],tblAargau[2001-2011])","v":23},0.56810982048574443,{"$f":"_xlfn.RANK.EQ(tblAargau[[#This Row],[1981-2011]],tblAargau[1981-2011])","v":72},3.53,{"$f":"_xlfn.RANK.EQ(tblAargau[[#This Row],[Fläche in km²]],tblAargau[Fläche in km²])","v":165},421,{"$f":"_xlfn.RANK.EQ(tblAargau[[#This Row],[Einwohner/km²]],tblAargau[Einwohner/km²])","v":85},105,{"$f":"_xlfn.RANK.EQ(tblAargau[[#This Row],[Tax]],tblAargau[Tax],1)","v":92}]
["Holderbank (AG)","Lenzburg",788,772,773,782,781,767,768,807,801,815,804,842,833,823,820,831,800,790,794,795,778,756,770,763,823,855,835,841,854,904,995,{"$f":"_xlfn.RANK.EQ(tblAargau[[#This Row],[2011]],tblAargau[2011])","v":155},3.4263959390862908E-2,-1.1194029850746245E-2,0.27892030848329052,{"$f":"_xlfn.RANK.EQ(tblAargau[[#This Row],[2001-2011]],tblAargau[2001-2011])","v":18},0.26269035532994933,{"$f":"_xlfn.RANK.EQ(tblAargau[[#This Row],[1981-2011]],tblAargau[1981-2011])","v":166},2.3199999999999998,{"$f":"_xlfn.RANK.EQ(tblAargau[[#This Row],[Fläche in km²]],tblAargau[Fläche in km²])","v":206},429,{"$f":"_xlfn.RANK.EQ(tblAargau[[#This Row],[Einwohner/km²]],tblAargau[Einwohner/km²])","v":84},100,{"$f":"_xlfn.RANK.EQ(tblAargau[[#This Row],[Tax]],tblAargau[Tax],1)","v":60}]
["Holziken","Kulm",935,953,967,978,992,997,1007,1004,1014,1001,1054,1063,1111,1109,1163,1184,1223,1230,1201,1179,1172,1160,1174,1170,1175,1151,1148,1150,1144,1218,1243,{"$f":"_xlfn.RANK.EQ(tblAargau[[#This Row],[2011]],tblAargau[2011])","v":136},7.0588235294117618E-2,0.11859582542694502,6.0580204778156954E-2,{"$f":"_xlfn.RANK.EQ(tblAargau[[#This Row],[2001-2011]],tblAargau[2001-2011])","v":154},0.32941176470588229,{"$f":"_xlfn.RANK.EQ(tblAargau[[#This Row],[1981-2011]],tblAargau[1981-2011])","v":143},2.86,{"$f":"_xlfn.RANK.EQ(tblAargau[[#This Row],[Fläche in km²]],tblAargau[Fläche in km²])","v":189},435,{"$f":"_xlfn.RANK.EQ(tblAargau[[#This Row],[Einwohner/km²]],tblAargau[Einwohner/km²])","v":82},104,{"$f":"_xlfn.RANK.EQ(tblAargau[[#This Row],[Tax]],tblAargau[Tax],1)","v":87}]
["Hornussen","Laufenburg",619,618,627,627,626,621,634,648,654,646,687,705,721,711,725,755,749,780,809,821,825,814,833,835,851,840,852,879,877,881,847,{"$f":"_xlfn.RANK.EQ(tblAargau[[#This Row],[2011]],tblAargau[2011])","v":168},4.3618739903069415E-2,0.19505094614264928,2.6666666666666616E-2,{"$f":"_xlfn.RANK.EQ(tblAargau[[#This Row],[2001-2011]],tblAargau[2001-2011])","v":178},0.36833602584814207,{"$f":"_xlfn.RANK.EQ(tblAargau[[#This Row],[1981-2011]],tblAargau[1981-2011])","v":126},7.27,{"$f":"_xlfn.RANK.EQ(tblAargau[[#This Row],[Fläche in km²]],tblAargau[Fläche in km²])","v":67},117,{"$f":"_xlfn.RANK.EQ(tblAargau[[#This Row],[Einwohner/km²]],tblAargau[Einwohner/km²])","v":188},125,{"$f":"_xlfn.RANK.EQ(tblAargau[[#This Row],[Tax]],tblAargau[Tax],1)","v":215}]
["Hunzenschwil","Lenzburg",2238,2231,2304,2314,2293,2343,2297,2309,2298,2341,2362,2397,2453,2496,2566,2562,2570,2569,2588,2607,2614,2696,2745,2737,2785,2825,2951,3009,3169,3216,3271,{"$f":"_xlfn.RANK.EQ(tblAargau[[#This Row],[2011]],tblAargau[2011])","v":64},4.602323503127792E-2,0.10372565622353935,0.25133894414690139,{"$f":"_xlfn.RANK.EQ(tblAargau[[#This Row],[2001-2011]],tblAargau[2001-2011])","v":22},0.46157283288650586,{"$f":"_xlfn.RANK.EQ(tblAargau[[#This Row],[1981-2011]],tblAargau[1981-2011])","v":95},3.26,{"$f":"_xlfn.RANK.EQ(tblAargau[[#This Row],[Fläche in km²]],tblAargau[Fläche in km²])","v":178},1003,{"$f":"_xlfn.RANK.EQ(tblAargau[[#This Row],[Einwohner/km²]],tblAargau[Einwohner/km²])","v":23},100,{"$f":"_xlfn.RANK.EQ(tblAargau[[#This Row],[Tax]],tblAargau[Tax],1)","v":60}]
["Islisberg","Bremgarten",157,154,163,187,199,204,214,235,240,249,256,267,273,269,268,270,302,312,321,396,429,448,489,496,487,477,489,504,531,543,539,{"$f":"_xlfn.RANK.EQ(tblAargau[[#This Row],[2011]],tblAargau[2011])","v":196},0.58598726114649691,0.546875,0.25641025641025639,{"$f":"_xlfn.RANK.EQ(tblAargau[[#This Row],[2001-2011]],tblAargau[2001-2011])","v":21},2.4331210191082802,{"$f":"_xlfn.RANK.EQ(tblAargau[[#This Row],[1981-2011]],tblAargau[1981-2011])","v":1},1.66,{"$f":"_xlfn.RANK.EQ(tblAargau[[#This Row],[Fläche in km²]],tblAargau[Fläche in km²])","v":212},325,{"$f":"_xlfn.RANK.EQ(tblAargau[[#This Row],[Einwohner/km²]],tblAargau[Einwohner/km²])","v":110},95,{"$f":"_xlfn.RANK.EQ(tblAargau[[#This Row],[Tax]],tblAargau[Tax],1)","v":30}]
["Jonen","Bremgarten",808,821,867,912,918,923,940,995,1034,1057,1112,1123,1225,1267,1345,1395,1423,1454,1489,1556,1616,1625,1646,1648,1659,1693,1736,1823,1856,1871,1886,{"$f":"_xlfn.RANK.EQ(tblAargau[[#This Row],[2011]],tblAargau[2011])","v":102},0.30816831683168311,0.39928057553956831,0.16707920792079212,{"$f":"_xlfn.RANK.EQ(tblAargau[[#This Row],[2001-2011]],tblAargau[2001-2011])","v":65},1.3341584158415842,{"$f":"_xlfn.RANK.EQ(tblAargau[[#This Row],[1981-2011]],tblAargau[1981-2011])","v":11},5.7,{"$f":"_xlfn.RANK.EQ(tblAargau[[#This Row],[Fläche in km²]],tblAargau[Fläche in km²])","v":102},331,{"$f":"_xlfn.RANK.EQ(tblAargau[[#This Row],[Einwohner/km²]],tblAargau[Einwohner/km²])","v":108},95,{"$f":"_xlfn.RANK.EQ(tblAargau[[#This Row],[Tax]],tblAargau[Tax],1)","v":30}]
["Kaiseraugst","Rheinfelden",3240,3310,3254,3175,3105,3130,3172,3233,3373,3540,3572,3637,3607,3623,3637,3602,3642,3682,3724,3892,4066,4229,4353,4579,4726,4793,4872,5042,5085,5119,5367,{"$f":"_xlfn.RANK.EQ(tblAargau[[#This Row],[2011]],tblAargau[2011])","v":29},9.259259259259256E-2,8.9585666293393151E-2,0.31997048696507635,{"$f":"_xlfn.RANK.EQ(tblAargau[[#This Row],[2001-2011]],tblAargau[2001-2011])","v":13},0.65648148148148144,{"$f":"_xlfn.RANK.EQ(tblAargau[[#This Row],[1981-2011]],tblAargau[1981-2011])","v":60},4.91,{"$f":"_xlfn.RANK.EQ(tblAargau[[#This Row],[Fläche in km²]],tblAargau[Fläche in km²])","v":123},1093,{"$f":"_xlfn.RANK.EQ(tblAargau[[#This Row],[Einwohner/km²]],tblAargau[Einwohner/km²])","v":17},90,{"$f":"_xlfn.RANK.EQ(tblAargau[[#This Row],[Tax]],tblAargau[Tax],1)","v":22}]
["Kaiserstuhl","Zurzach",390,378,366,370,361,356,371,371,381,412,424,437,454,463,447,438,440,439,427,437,445,446,405,411,414,404,399,394,404,397,402,{"$f":"_xlfn.RANK.EQ(tblAargau[[#This Row],[2011]],tblAargau[2011])","v":203},5.6410256410256432E-2,3.0660377358490587E-2,-9.6629213483146015E-2,{"$f":"_xlfn.RANK.EQ(tblAargau[[#This Row],[2001-2011]],tblAargau[2001-2011])","v":218},3.076923076923066E-2,{"$f":"_xlfn.RANK.EQ(tblAargau[[#This Row],[1981-2011]],tblAargau[1981-2011])","v":213},0.32,{"$f":"_xlfn.RANK.EQ(tblAargau[[#This Row],[Fläche in km²]],tblAargau[Fläche in km²])","v":219},1256,{"$f":"_xlfn.RANK.EQ(tblAargau[[#This Row],[Einwohner/km²]],tblAargau[Einwohner/km²])","v":15},120,{"$f":"_xlfn.RANK.EQ(tblAargau[[#This Row],[Tax]],tblAargau[Tax],1)","v":195}]
["Kaisten","Laufenburg",1896,1902,1903,1914,1867,1885,1894,1891,1863,1887,1986,1991,2043,2067,2107,2123,2187,2243,2263,2303,2330,2365,2331,2328,2361,2424,2466,2502,2509,2553,2586,{"$f":"_xlfn.RANK.EQ(tblAargau[[#This Row],[2011]],tblAargau[2011])","v":79},-4.746835443038E-3,0.15961732124874128,0.10987124463519304,{"$f":"_xlfn.RANK.EQ(tblAargau[[#This Row],[2001-2011]],tblAargau[2001-2011])","v":118},0.36392405063291133,{"$f":"_xlfn.RANK.EQ(tblAargau[[#This Row],[1981-2011]],tblAargau[1981-2011])","v":131},18.11,{"$f":"_xlfn.RANK.EQ(tblAargau[[#This Row],[Fläche in km²]],tblAargau[Fläche in km²])","v":5},143,{"$f":"_xlfn.RANK.EQ(tblAargau[[#This Row],[Einwohner/km²]],tblAargau[Einwohner/km²])","v":181},105,{"$f":"_xlfn.RANK.EQ(tblAargau[[#This Row],[Tax]],tblAargau[Tax],1)","v":92}]
["Kallern","Muri",221,232,232,234,234,250,253,254,267,266,277,281,280,281,288,290,283,283,269,276,269,273,284,300,298,301,313,317,318,319,309,{"$f":"_xlfn.RANK.EQ(tblAargau[[#This Row],[2011]],tblAargau[2011])","v":209},0.20361990950226239,-3.6101083032491488E-3,0.14869888475836435,{"$f":"_xlfn.RANK.EQ(tblAargau[[#This Row],[2001-2011]],tblAargau[2001-2011])","v":78},0.3981900452488687,{"$f":"_xlfn.RANK.EQ(tblAargau[[#This Row],[1981-2011]],tblAargau[1981-2011])","v":113},2.68,{"$f":"_xlfn.RANK.EQ(tblAargau[[#This Row],[Fläche in km²]],tblAargau[Fläche in km²])","v":195},115,{"$f":"_xlfn.RANK.EQ(tblAargau[[#This Row],[Einwohner/km²]],tblAargau[Einwohner/km²])","v":191},110,{"$f":"_xlfn.RANK.EQ(tblAargau[[#This Row],[Tax]],tblAargau[Tax],1)","v":117}]
["Killwangen","Baden",1012,1059,1047,1068,1094,1085,1131,1279,1301,1288,1286,1295,1311,1319,1339,1359,1363,1347,1367,1396,1383,1480,1539,1553,1658,1715,1782,1782,1778,1801,1872,{"$f":"_xlfn.RANK.EQ(tblAargau[[#This Row],[2011]],tblAargau[2011])","v":103},0.27272727272727271,8.5536547433903598E-2,0.35357917570498909,{"$f":"_xlfn.RANK.EQ(tblAargau[[#This Row],[2001-2011]],tblAargau[2001-2011])","v":9},0.84980237154150196,{"$f":"_xlfn.RANK.EQ(tblAargau[[#This Row],[1981-2011]],tblAargau[1981-2011])","v":34},2.4300000000000002,{"$f":"_xlfn.RANK.EQ(tblAargau[[#This Row],[Fläche in km²]],tblAargau[Fläche in km²])","v":203},770,{"$f":"_xlfn.RANK.EQ(tblAargau[[#This Row],[Einwohner/km²]],tblAargau[Einwohner/km²])","v":41},105,{"$f":"_xlfn.RANK.EQ(tblAargau[[#This Row],[Tax]],tblAargau[Tax],1)","v":92}]
["Kirchleerau","Zofingen",671,653,662,661,650,648,656,647,642,638,647,677,694,709,742,736,734,725,704,731,732,726,740,761,757,766,742,745,742,755,764,{"$f":"_xlfn.RANK.EQ(tblAargau[[#This Row],[2011]],tblAargau[2011])","v":179},-4.9180327868852514E-2,0.12982998454404937,4.3715846994535568E-2,{"$f":"_xlfn.RANK.EQ(tblAargau[[#This Row],[2001-2011]],tblAargau[2001-2011])","v":167},0.13859910581222046,{"$f":"_xlfn.RANK.EQ(tblAargau[[#This Row],[1981-2011]],tblAargau[1981-2011])","v":200},4.3600000000000003,{"$f":"_xlfn.RANK.EQ(tblAargau[[#This Row],[Fläche in km²]],tblAargau[Fläche in km²])","v":142},175,{"$f":"_xlfn.RANK.EQ(tblAargau[[#This Row],[Einwohner/km²]],tblAargau[Einwohner/km²])","v":167},115,{"$f":"_xlfn.RANK.EQ(tblAargau[[#This Row],[Tax]],tblAargau[Tax],1)","v":150}]
["Klingnau","Zurzach",2393,2413,2385,2420,2515,2530,2522,2486,2511,2521,2635,2658,2701,2703,2699,2699,2760,2779,2703,2747,2783,2837,2845,2896,2893,2894,2979,3046,3070,3074,3117,{"$f":"_xlfn.RANK.EQ(tblAargau[[#This Row],[2011]],tblAargau[2011])","v":66},5.3489343919765897E-2,4.2504743833017056E-2,0.12001437297879991,{"$f":"_xlfn.RANK.EQ(tblAargau[[#This Row],[2001-2011]],tblAargau[2001-2011])","v":105},0.30254910154617631,{"$f":"_xlfn.RANK.EQ(tblAargau[[#This Row],[1981-2011]],tblAargau[1981-2011])","v":155},6.71,{"$f":"_xlfn.RANK.EQ(tblAargau[[#This Row],[Fläche in km²]],tblAargau[Fläche in km²])","v":80},465,{"$f":"_xlfn.RANK.EQ(tblAargau[[#This Row],[Einwohner/km²]],tblAargau[Einwohner/km²])","v":77},103,{"$f":"_xlfn.RANK.EQ(tblAargau[[#This Row],[Tax]],tblAargau[Tax],1)","v":81}]
["Koblenz","Zurzach",1454,1455,1439,1409,1380,1395,1439,1469,1487,1520,1546,1576,1603,1673,1643,1606,1570,1536,1600,1573,1557,1536,1578,1571,1553,1575,1565,1574,1578,1582,1586,{"$f":"_xlfn.RANK.EQ(tblAargau[[#This Row],[2011]],tblAargau[2011])","v":113},4.5392022008253097E-2,1.7464424320827954E-2,1.862556197816323E-2,{"$f":"_xlfn.RANK.EQ(tblAargau[[#This Row],[2001-2011]],tblAargau[2001-2011])","v":184},9.0784044016506193E-2,{"$f":"_xlfn.RANK.EQ(tblAargau[[#This Row],[1981-2011]],tblAargau[1981-2011])","v":210},4.08,{"$f":"_xlfn.RANK.EQ(tblAargau[[#This Row],[Fläche in km²]],tblAargau[Fläche in km²])","v":150},389,{"$f":"_xlfn.RANK.EQ(tblAargau[[#This Row],[Einwohner/km²]],tblAargau[Einwohner/km²])","v":95},118,{"$f":"_xlfn.RANK.EQ(tblAargau[[#This Row],[Tax]],tblAargau[Tax],1)","v":178}]
["Kölliken","Zofingen",3068,3123,3188,3196,3216,3234,3253,3314,3374,3407,3586,3693,3745,3736,3767,3770,3831,3864,3874,3891,3869,3867,3885,3927,4006,4026,4063,4045,4065,4095,4192,{"$f":"_xlfn.RANK.EQ(tblAargau[[#This Row],[2011]],tblAargau[2011])","v":44},0.1104954367666231,8.5052983825989914E-2,8.3484104419746741E-2,{"$f":"_xlfn.RANK.EQ(tblAargau[[#This Row],[2001-2011]],tblAargau[2001-2011])","v":137},0.36636245110821375,{"$f":"_xlfn.RANK.EQ(tblAargau[[#This Row],[1981-2011]],tblAargau[1981-2011])","v":129},8.89,{"$f":"_xlfn.RANK.EQ(tblAargau[[#This Row],[Fläche in km²]],tblAargau[Fläche in km²])","v":46},472,{"$f":"_xlfn.RANK.EQ(tblAargau[[#This Row],[Einwohner/km²]],tblAargau[Einwohner/km²])","v":76},117,{"$f":"_xlfn.RANK.EQ(tblAargau[[#This Row],[Tax]],tblAargau[Tax],1)","v":168}]
["Künten","Baden",1131,1125,1132,1115,1143,1156,1178,1256,1292,1302,1380,1431,1492,1483,1519,1507,1492,1494,1501,1503,1522,1557,1599,1607,1595,1574,1577,1598,1601,1580,1592,{"$f":"_xlfn.RANK.EQ(tblAargau[[#This Row],[2011]],tblAargau[2011])","v":112},0.1511936339522546,8.9130434782608736E-2,4.5992115637319309E-2,{"$f":"_xlfn.RANK.EQ(tblAargau[[#This Row],[2001-2011]],tblAargau[2001-2011])","v":164},0.40760389036251099,{"$f":"_xlfn.RANK.EQ(tblAargau[[#This Row],[1981-2011]],tblAargau[1981-2011])","v":112},4.8899999999999997,{"$f":"_xlfn.RANK.EQ(tblAargau[[#This Row],[Fläche in km²]],tblAargau[Fläche in km²])","v":126},326,{"$f":"_xlfn.RANK.EQ(tblAargau[[#This Row],[Einwohner/km²]],tblAargau[Einwohner/km²])","v":109},109,{"$f":"_xlfn.RANK.EQ(tblAargau[[#This Row],[Tax]],tblAargau[Tax],1)","v":112}]
["Küttigen","Aarau",4383,4466,4528,4476,4547,4612,4582,4631,4646,4678,4712,4730,4760,4777,4833,4910,4910,4926,4907,4916,4960,4997,4991,5030,5149,5298,5315,5315,5443,5564,5798,{"$f":"_xlfn.RANK.EQ(tblAargau[[#This Row],[2011]],tblAargau[2011])","v":26},6.7305498516997408E-2,4.3293718166383721E-2,0.1689516129032258,{"$f":"_xlfn.RANK.EQ(tblAargau[[#This Row],[2001-2011]],tblAargau[2001-2011])","v":64},0.32283823864932693,{"$f":"_xlfn.RANK.EQ(tblAargau[[#This Row],[1981-2011]],tblAargau[1981-2011])","v":146},11.89,{"$f":"_xlfn.RANK.EQ(tblAargau[[#This Row],[Fläche in km²]],tblAargau[Fläche in km²])","v":20},488,{"$f":"_xlfn.RANK.EQ(tblAargau[[#This Row],[Einwohner/km²]],tblAargau[Einwohner/km²])","v":74},103,{"$f":"_xlfn.RANK.EQ(tblAargau[[#This Row],[Tax]],tblAargau[Tax],1)","v":81}]
["Laufenburg","Laufenburg",2806,2814,2818,2847,2814,2793,2834,2794,2780,2762,2885,2949,2977,3051,3118,3152,3127,3167,3119,3125,3099,3116,3166,3202,3183,3195,3159,3184,3204,3176,3238,{"$f":"_xlfn.RANK.EQ(tblAargau[[#This Row],[2011]],tblAargau[2011])","v":65},-1.5680684248039922E-2,8.3188908145580553E-2,4.4853178444659525E-2,{"$f":"_xlfn.RANK.EQ(tblAargau[[#This Row],[2001-2011]],tblAargau[2001-2011])","v":165},0.15395580898075556,{"$f":"_xlfn.RANK.EQ(tblAargau[[#This Row],[1981-2011]],tblAargau[1981-2011])","v":197},14.49,{"$f":"_xlfn.RANK.EQ(tblAargau[[#This Row],[Fläche in km²]],tblAargau[Fläche in km²])","v":8},223,{"$f":"_xlfn.RANK.EQ(tblAargau[[#This Row],[Einwohner/km²]],tblAargau[Einwohner/km²])","v":137},104,{"$f":"_xlfn.RANK.EQ(tblAargau[[#This Row],[Tax]],tblAargau[Tax],1)","v":87}]
["Leibstadt","Zurzach",1139,1111,1107,1087,1092,1085,1117,1102,1132,1166,1213,1255,1277,1313,1329,1325,1313,1344,1321,1283,1275,1302,1325,1277,1264,1266,1281,1312,1325,1307,1340,{"$f":"_xlfn.RANK.EQ(tblAargau[[#This Row],[2011]],tblAargau[2011])","v":128},2.3705004389815709E-2,5.7708161582852524E-2,5.0980392156862786E-2,{"$f":"_xlfn.RANK.EQ(tblAargau[[#This Row],[2001-2011]],tblAargau[2001-2011])","v":160},0.17647058823529416,{"$f":"_xlfn.RANK.EQ(tblAargau[[#This Row],[1981-2011]],tblAargau[1981-2011])","v":192},6.39,{"$f":"_xlfn.RANK.EQ(tblAargau[[#This Row],[Fläche in km²]],tblAargau[Fläche in km²])","v":83},210,{"$f":"_xlfn.RANK.EQ(tblAargau[[#This Row],[Einwohner/km²]],tblAargau[Einwohner/km²])","v":146},100,{"$f":"_xlfn.RANK.EQ(tblAargau[[#This Row],[Tax]],tblAargau[Tax],1)","v":60}]
["Leimbach (AG)","Kulm",339,350,361,372,361,362,357,365,361,374,389,387,381,376,379,389,382,389,398,407,393,404,400,387,392,410,432,428,436,445,448,{"$f":"_xlfn.RANK.EQ(tblAargau[[#This Row],[2011]],tblAargau[2011])","v":199},0.10324483775811211,4.6272493573264795E-2,0.13994910941475824,{"$f":"_xlfn.RANK.EQ(tblAargau[[#This Row],[2001-2011]],tblAargau[2001-2011])","v":86},0.32153392330383479,{"$f":"_xlfn.RANK.EQ(tblAargau[[#This Row],[1981-2011]],tblAargau[1981-2011])","v":148},1.1499999999999999,{"$f":"_xlfn.RANK.EQ(tblAargau[[#This Row],[Fläche in km²]],tblAargau[Fläche in km²])","v":217},390,{"$f":"_xlfn.RANK.EQ(tblAargau[[#This Row],[Einwohner/km²]],tblAargau[Einwohner/km²])","v":94},105,{"$f":"_xlfn.RANK.EQ(tblAargau[[#This Row],[Tax]],tblAargau[Tax],1)","v":92}]
["Lengnau (AG)","Zurzach",1869,1929,1925,1868,1862,1827,1856,1882,1919,2000,2072,2094,2087,2059,2111,2114,2097,2140,2224,2254,2307,2317,2334,2390,2422,2419,2459,2470,2496,2527,2556,{"$f":"_xlfn.RANK.EQ(tblAargau[[#This Row],[2011]],tblAargau[2011])","v":81},7.0090957731407277E-2,8.783783783783794E-2,0.10793237971391423,{"$f":"_xlfn.RANK.EQ(tblAargau[[#This Row],[2001-2011]],tblAargau[2001-2011])","v":119},0.3675762439807384,{"$f":"_xlfn.RANK.EQ(tblAargau[[#This Row],[1981-2011]],tblAargau[1981-2011])","v":128},12.67,{"$f":"_xlfn.RANK.EQ(tblAargau[[#This Row],[Fläche in km²]],tblAargau[Fläche in km²])","v":14},202,{"$f":"_xlfn.RANK.EQ(tblAargau[[#This Row],[Einwohner/km²]],tblAargau[Einwohner/km²])","v":152},110,{"$f":"_xlfn.RANK.EQ(tblAargau[[#This Row],[Tax]],tblAargau[Tax],1)","v":117}]
["Lenzburg","Lenzburg",7533,7515,7497,7489,7538,7429,7337,7320,7275,7218,7292,7226,7311,7321,7450,7403,7388,7361,7388,7427,7468,7517,7518,7501,7551,7702,7852,7984,8146,8296,8586,{"$f":"_xlfn.RANK.EQ(tblAargau[[#This Row],[2011]],tblAargau[2011])","v":12},-4.1816009557945066E-2,1.8513439385628105E-2,0.1497054097482593,{"$f":"_xlfn.RANK.EQ(tblAargau[[#This Row],[2001-2011]],tblAargau[2001-2011])","v":77},0.13978494623655924,{"$f":"_xlfn.RANK.EQ(tblAargau[[#This Row],[1981-2011]],tblAargau[1981-2011])","v":199},11.33,{"$f":"_xlfn.RANK.EQ(tblAargau[[#This Row],[Fläche in km²]],tblAargau[Fläche in km²])","v":24},758,{"$f":"_xlfn.RANK.EQ(tblAargau[[#This Row],[Einwohner/km²]],tblAargau[Einwohner/km²])","v":43},108,{"$f":"_xlfn.RANK.EQ(tblAargau[[#This Row],[Tax]],tblAargau[Tax],1)","v":105}]
["Leuggern","Zurzach",1677,1687,1722,1745,1796,1796,1832,1865,1945,1981,2026,2026,2043,2095,2134,2174,2155,2148,2174,2145,2113,2137,2141,2128,2081,2068,2056,2045,2082,2107,2145,{"$f":"_xlfn.RANK.EQ(tblAargau[[#This Row],[2011]],tblAargau[2011])","v":90},0.18127608825283237,5.8736426456071023E-2,1.5144344533838172E-2,{"$f":"_xlfn.RANK.EQ(tblAargau[[#This Row],[2001-2011]],tblAargau[2001-2011])","v":185},0.27906976744186052,{"$f":"_xlfn.RANK.EQ(tblAargau[[#This Row],[1981-2011]],tblAargau[1981-2011])","v":162},13.76,{"$f":"_xlfn.RANK.EQ(tblAargau[[#This Row],[Fläche in km²]],tblAargau[Fläche in km²])","v":9},156,{"$f":"_xlfn.RANK.EQ(tblAargau[[#This Row],[Einwohner/km²]],tblAargau[Einwohner/km²])","v":174},117,{"$f":"_xlfn.RANK.EQ(tblAargau[[#This Row],[Tax]],tblAargau[Tax],1)","v":168}]
["Leutwil","Kulm",494,494,486,495,504,503,528,542,539,540,557,575,599,611,603,620,632,623,643,668,680,667,683,700,700,715,713,725,739,731,738,{"$f":"_xlfn.RANK.EQ(tblAargau[[#This Row],[2011]],tblAargau[2011])","v":180},9.3117408906882693E-2,0.19928186714542195,8.5294117647058743E-2,{"$f":"_xlfn.RANK.EQ(tblAargau[[#This Row],[2001-2011]],tblAargau[2001-2011])","v":136},0.49392712550607287,{"$f":"_xlfn.RANK.EQ(tblAargau[[#This Row],[1981-2011]],tblAargau[1981-2011])","v":87},3.75,{"$f":"_xlfn.RANK.EQ(tblAargau[[#This Row],[Fläche in km²]],tblAargau[Fläche in km²])","v":160},197,{"$f":"_xlfn.RANK.EQ(tblAargau[[#This Row],[Einwohner/km²]],tblAargau[Einwohner/km²])","v":155},117,{"$f":"_xlfn.RANK.EQ(tblAargau[[#This Row],[Tax]],tblAargau[Tax],1)","v":168}]
["Linn","Brugg",88,82,83,79,91,89,87,89,105,101,105,112,109,101,99,100,110,107,103,109,125,128,133,144,145,146,142,138,134,137,136,{"$f":"_xlfn.RANK.EQ(tblAargau[[#This Row],[2011]],tblAargau[2011])","v":218},0.14772727272727271,3.8095238095238182E-2,8.8000000000000078E-2,{"$f":"_xlfn.RANK.EQ(tblAargau[[#This Row],[2001-2011]],tblAargau[2001-2011])","v":134},0.54545454545454541,{"$f":"_xlfn.RANK.EQ(tblAargau[[#This Row],[1981-2011]],tblAargau[1981-2011])","v":79},2.5499999999999998,{"$f":"_xlfn.RANK.EQ(tblAargau[[#This Row],[Fläche in km²]],tblAargau[Fläche in km²])","v":198},53,{"$f":"_xlfn.RANK.EQ(tblAargau[[#This Row],[Einwohner/km²]],tblAargau[Einwohner/km²])","v":219},115,{"$f":"_xlfn.RANK.EQ(tblAargau[[#This Row],[Tax]],tblAargau[Tax],1)","v":150}]
["Lupfig","Brugg",938,962,962,958,997,1111,1160,1140,1246,1308,1409,1395,1478,1532,1525,1537,1550,1699,1730,1792,1810,1829,1893,1939,1978,1951,2031,2059,2124,2170,2145,{"$f":"_xlfn.RANK.EQ(tblAargau[[#This Row],[2011]],tblAargau[2011])","v":90},0.3944562899786781,0.27182398864442869,0.18508287292817682,{"$f":"_xlfn.RANK.EQ(tblAargau[[#This Row],[2001-2011]],tblAargau[2001-2011])","v":51},1.2867803837953091,{"$f":"_xlfn.RANK.EQ(tblAargau[[#This Row],[1981-2011]],tblAargau[1981-2011])","v":13},5.15,{"$f":"_xlfn.RANK.EQ(tblAargau[[#This Row],[Fläche in km²]],tblAargau[Fläche in km²])","v":116},417,{"$f":"_xlfn.RANK.EQ(tblAargau[[#This Row],[Einwohner/km²]],tblAargau[Einwohner/km²])","v":86},95,{"$f":"_xlfn.RANK.EQ(tblAargau[[#This Row],[Tax]],tblAargau[Tax],1)","v":30}]
["Magden","Rheinfelden",2281,2313,2346,2384,2412,2481,2503,2587,2625,2656,2745,2746,2743,2782,2832,2880,2884,2959,3029,3065,3080,3124,3165,3233,3284,3346,3415,3478,3555,3609,3663,{"$f":"_xlfn.RANK.EQ(tblAargau[[#This Row],[2011]],tblAargau[2011])","v":56},0.16440157825515134,0.11657559198542811,0.18928571428571428,{"$f":"_xlfn.RANK.EQ(tblAargau[[#This Row],[2001-2011]],tblAargau[2001-2011])","v":45},0.60587461639631734,{"$f":"_xlfn.RANK.EQ(tblAargau[[#This Row],[1981-2011]],tblAargau[1981-2011])","v":65},11.01,{"$f":"_xlfn.RANK.EQ(tblAargau[[#This Row],[Fläche in km²]],tblAargau[Fläche in km²])","v":29},333,{"$f":"_xlfn.RANK.EQ(tblAargau[[#This Row],[Einwohner/km²]],tblAargau[Einwohner/km²])","v":107},100,{"$f":"_xlfn.RANK.EQ(tblAargau[[#This Row],[Tax]],tblAargau[Tax],1)","v":60}]
["Mägenwil","Baden",984,997,1049,1045,1066,1063,1089,1113,1211,1264,1299,1318,1327,1353,1379,1385,1434,1449,1502,1546,1579,1622,1637,1643,1697,1768,1804,1828,1881,1946,2004,{"$f":"_xlfn.RANK.EQ(tblAargau[[#This Row],[2011]],tblAargau[2011])","v":98},0.28455284552845539,0.19014626635873744,0.26915769474350859,{"$f":"_xlfn.RANK.EQ(tblAargau[[#This Row],[2001-2011]],tblAargau[2001-2011])","v":20},1.0365853658536586,{"$f":"_xlfn.RANK.EQ(tblAargau[[#This Row],[1981-2011]],tblAargau[1981-2011])","v":21},3.48,{"$f":"_xlfn.RANK.EQ(tblAargau[[#This Row],[Fläche in km²]],tblAargau[Fläche in km²])","v":167},576,{"$f":"_xlfn.RANK.EQ(tblAargau[[#This Row],[Einwohner/km²]],tblAargau[Einwohner/km²])","v":61},85,{"$f":"_xlfn.RANK.EQ(tblAargau[[#This Row],[Tax]],tblAargau[Tax],1)","v":10}]
["Mandach","Brugg",273,265,261,251,266,269,281,301,301,305,320,323,332,329,322,323,321,320,320,315,318,313,306,309,312,320,315,309,306,302,310,{"$f":"_xlfn.RANK.EQ(tblAargau[[#This Row],[2011]],tblAargau[2011])","v":208},0.11721611721611724,-1.5625E-2,-2.515723270440251E-2,{"$f":"_xlfn.RANK.EQ(tblAargau[[#This Row],[2001-2011]],tblAargau[2001-2011])","v":205},0.13553113553113549,{"$f":"_xlfn.RANK.EQ(tblAargau[[#This Row],[1981-2011]],tblAargau[1981-2011])","v":201},5.55,{"$f":"_xlfn.RANK.EQ(tblAargau[[#This Row],[Fläche in km²]],tblAargau[Fläche in km²])","v":105},56,{"$f":"_xlfn.RANK.EQ(tblAargau[[#This Row],[Einwohner/km²]],tblAargau[Einwohner/km²])","v":217},120,{"$f":"_xlfn.RANK.EQ(tblAargau[[#This Row],[Tax]],tblAargau[Tax],1)","v":195}]
["Meisterschwanden","Lenzburg",1536,1509,1549,1570,1571,1560,1578,1629,1667,1702,1785,1810,1842,1824,1832,1847,1952,1979,2038,2047,2073,2079,2118,2197,2338,2343,2347,2439,2542,2626,2693,{"$f":"_xlfn.RANK.EQ(tblAargau[[#This Row],[2011]],tblAargau[2011])","v":75},0.10807291666666674,0.14677871148459376,0.29908345393150015,{"$f":"_xlfn.RANK.EQ(tblAargau[[#This Row],[2001-2011]],tblAargau[2001-2011])","v":16},0.75325520833333326,{"$f":"_xlfn.RANK.EQ(tblAargau[[#This Row],[1981-2011]],tblAargau[1981-2011])","v":45},4.2699999999999996,{"$f":"_xlfn.RANK.EQ(tblAargau[[#This Row],[Fläche in km²]],tblAargau[Fläche in km²])","v":144},631,{"$f":"_xlfn.RANK.EQ(tblAargau[[#This Row],[Einwohner/km²]],tblAargau[Einwohner/km²])","v":52},74,{"$f":"_xlfn.RANK.EQ(tblAargau[[#This Row],[Tax]],tblAargau[Tax],1)","v":3}]
["Mellikon","Zurzach",203,186,192,192,183,199,212,219,232,225,236,234,257,279,277,272,267,267,246,252,252,247,230,242,250,251,249,247,231,233,246,{"$f":"_xlfn.RANK.EQ(tblAargau[[#This Row],[2011]],tblAargau[2011])","v":213},0.10837438423645329,6.7796610169491567E-2,-2.3809523809523836E-2,{"$f":"_xlfn.RANK.EQ(tblAargau[[#This Row],[2001-2011]],tblAargau[2001-2011])","v":204},0.21182266009852224,{"$f":"_xlfn.RANK.EQ(tblAargau[[#This Row],[1981-2011]],tblAargau[1981-2011])","v":182},2.71,{"$f":"_xlfn.RANK.EQ(tblAargau[[#This Row],[Fläche in km²]],tblAargau[Fläche in km²])","v":194},91,{"$f":"_xlfn.RANK.EQ(tblAargau[[#This Row],[Einwohner/km²]],tblAargau[Einwohner/km²])","v":205},115,{"$f":"_xlfn.RANK.EQ(tblAargau[[#This Row],[Tax]],tblAargau[Tax],1)","v":150}]
["Mellingen","Baden",3279,3314,3413,3484,3487,3522,3588,3649,3677,3714,3789,3877,3962,3972,3992,4024,4089,4070,4063,4182,4317,4355,4291,4256,4275,4425,4502,4547,4642,4633,4645,{"$f":"_xlfn.RANK.EQ(tblAargau[[#This Row],[2011]],tblAargau[2011])","v":34},0.13266239707227823,0.10372129849564526,7.5978688904331682E-2,{"$f":"_xlfn.RANK.EQ(tblAargau[[#This Row],[2001-2011]],tblAargau[2001-2011])","v":141},0.41659042390972867,{"$f":"_xlfn.RANK.EQ(tblAargau[[#This Row],[1981-2011]],tblAargau[1981-2011])","v":108},4.87,{"$f":"_xlfn.RANK.EQ(tblAargau[[#This Row],[Fläche in km²]],tblAargau[Fläche in km²])","v":127},954,{"$f":"_xlfn.RANK.EQ(tblAargau[[#This Row],[Einwohner/km²]],tblAargau[Einwohner/km²])","v":27},105,{"$f":"_xlfn.RANK.EQ(tblAargau[[#This Row],[Tax]],tblAargau[Tax],1)","v":92}]
["Menziken","Kulm",4513,4510,4440,4415,4504,4541,4533,4512,4575,4596,4778,4923,5023,5195,5378,5449,5382,5376,5379,5409,5402,5468,5459,5451,5397,5417,5479,5456,5559,5580,5563,{"$f":"_xlfn.RANK.EQ(tblAargau[[#This Row],[2011]],tblAargau[2011])","v":28},1.8391313981830359E-2,0.13206362494767676,2.9803776379118796E-2,{"$f":"_xlfn.RANK.EQ(tblAargau[[#This Row],[2001-2011]],tblAargau[2001-2011])","v":176},0.23266120097496112,{"$f":"_xlfn.RANK.EQ(tblAargau[[#This Row],[1981-2011]],tblAargau[1981-2011])","v":179},6.39,{"$f":"_xlfn.RANK.EQ(tblAargau[[#This Row],[Fläche in km²]],tblAargau[Fläche in km²])","v":83},871,{"$f":"_xlfn.RANK.EQ(tblAargau[[#This Row],[Einwohner/km²]],tblAargau[Einwohner/km²])","v":34},119,{"$f":"_xlfn.RANK.EQ(tblAargau[[#This Row],[Tax]],tblAargau[Tax],1)","v":189}]
["Merenschwand","Muri",1415,1408,1431,1414,1413,1407,1406,1425,1393,1466,1610,1643,1696,1720,1782,1928,1926,2023,2049,2179,2253,2326,2363,2384,2446,2453,2462,2455,2476,2600,3275,{"$f":"_xlfn.RANK.EQ(tblAargau[[#This Row],[2011]],tblAargau[2011])","v":63},3.6042402826855113E-2,0.35341614906832297,0.45361739902352416,{"$f":"_xlfn.RANK.EQ(tblAargau[[#This Row],[2001-2011]],tblAargau[2001-2011])","v":2},1.3144876325088339,{"$f":"_xlfn.RANK.EQ(tblAargau[[#This Row],[1981-2011]],tblAargau[1981-2011])","v":12},13.5,{"$f":"_xlfn.RANK.EQ(tblAargau[[#This Row],[Fläche in km²]],tblAargau[Fläche in km²])","v":11},243,{"$f":"_xlfn.RANK.EQ(tblAargau[[#This Row],[Einwohner/km²]],tblAargau[Einwohner/km²])","v":130},99,{"$f":"_xlfn.RANK.EQ(tblAargau[[#This Row],[Tax]],tblAargau[Tax],1)","v":53}]
["Mettauertal","Laufenburg",1518,1523,1532,1537,1548,1567,1558,1592,1641,1677,1741,1780,1818,1845,1888,1941,1937,1901,1936,1869,1885,1870,1875,1890,1934,1965,1946,1921,1930,1927,1896,{"$f":"_xlfn.RANK.EQ(tblAargau[[#This Row],[2011]],tblAargau[2011])","v":101},0.10474308300395263,7.3520964962665136E-2,5.8355437665782439E-3,{"$f":"_xlfn.RANK.EQ(tblAargau[[#This Row],[2001-2011]],tblAargau[2001-2011])","v":193},0.24901185770750978,{"$f":"_xlfn.RANK.EQ(tblAargau[[#This Row],[1981-2011]],tblAargau[1981-2011])","v":173},21.56,{"$f":"_xlfn.RANK.EQ(tblAargau[[#This Row],[Fläche in km²]],tblAargau[Fläche in km²])","v":1},88,{"$f":"_xlfn.RANK.EQ(tblAargau[[#This Row],[Einwohner/km²]],tblAargau[Einwohner/km²])","v":207},107,{"$f":"_xlfn.RANK.EQ(tblAargau[[#This Row],[Tax]],tblAargau[Tax],1)","v":103}]
["Möhlin","Rheinfelden",6330,6417,6468,6472,6406,6452,6555,6660,6838,7044,7353,7428,7579,7749,7832,7947,8063,8229,8258,8292,8377,8382,8533,8721,8884,9070,9246,9420,9757,9922,10201,{"$f":"_xlfn.RANK.EQ(tblAargau[[#This Row],[2011]],tblAargau[2011])","v":10},0.11279620853080563,0.12770297837617295,0.21773904739166761,{"$f":"_xlfn.RANK.EQ(tblAargau[[#This Row],[2001-2011]],tblAargau[2001-2011])","v":30},0.61153238546603483,{"$f":"_xlfn.RANK.EQ(tblAargau[[#This Row],[1981-2011]],tblAargau[1981-2011])","v":64},18.79,{"$f":"_xlfn.RANK.EQ(tblAargau[[#This Row],[Fläche in km²]],tblAargau[Fläche in km²])","v":3},543,{"$f":"_xlfn.RANK.EQ(tblAargau[[#This Row],[Einwohner/km²]],tblAargau[Einwohner/km²])","v":63},115,{"$f":"_xlfn.RANK.EQ(tblAargau[[#This Row],[Tax]],tblAargau[Tax],1)","v":150}]
["Mönthal","Brugg",302,318,327,327,342,355,361,388,394,383,415,428,447,445,466,438,436,433,430,435,442,431,421,402,400,412,418,406,402,410,407,{"$f":"_xlfn.RANK.EQ(tblAargau[[#This Row],[2011]],tblAargau[2011])","v":202},0.26821192052980125,4.8192771084337283E-2,-7.9185520361991002E-2,{"$f":"_xlfn.RANK.EQ(tblAargau[[#This Row],[2001-2011]],tblAargau[2001-2011])","v":216},0.34768211920529812,{"$f":"_xlfn.RANK.EQ(tblAargau[[#This Row],[1981-2011]],tblAargau[1981-2011])","v":137},3.93,{"$f":"_xlfn.RANK.EQ(tblAargau[[#This Row],[Fläche in km²]],tblAargau[Fläche in km²])","v":154},104,{"$f":"_xlfn.RANK.EQ(tblAargau[[#This Row],[Einwohner/km²]],tblAargau[Einwohner/km²])","v":197},110,{"$f":"_xlfn.RANK.EQ(tblAargau[[#This Row],[Tax]],tblAargau[Tax],1)","v":117}]
["Moosleerau","Zofingen",592,603,609,614,613,618,642,650,683,702,755,782,798,791,818,801,812,811,809,810,791,786,801,800,812,820,820,818,833,850,845,{"$f":"_xlfn.RANK.EQ(tblAargau[[#This Row],[2011]],tblAargau[2011])","v":169},0.18581081081081074,7.2847682119205226E-2,6.8268015170670049E-2,{"$f":"_xlfn.RANK.EQ(tblAargau[[#This Row],[2001-2011]],tblAargau[2001-2011])","v":147},0.42736486486486491,{"$f":"_xlfn.RANK.EQ(tblAargau[[#This Row],[1981-2011]],tblAargau[1981-2011])","v":104},3.81,{"$f":"_xlfn.RANK.EQ(tblAargau[[#This Row],[Fläche in km²]],tblAargau[Fläche in km²])","v":159},222,{"$f":"_xlfn.RANK.EQ(tblAargau[[#This Row],[Einwohner/km²]],tblAargau[Einwohner/km²])","v":138},115,{"$f":"_xlfn.RANK.EQ(tblAargau[[#This Row],[Tax]],tblAargau[Tax],1)","v":150}]
["Möriken-Wildegg","Lenzburg",2855,2878,2929,2886,2895,2921,3025,3085,3220,3340,3430,3432,3448,3501,3512,3513,3459,3407,3396,3430,3450,3585,3600,3654,3672,3748,3766,3871,3936,3988,4138,{"$f":"_xlfn.RANK.EQ(tblAargau[[#This Row],[2011]],tblAargau[2011])","v":46},0.16987740805604212,0,0.19942028985507254,{"$f":"_xlfn.RANK.EQ(tblAargau[[#This Row],[2001-2011]],tblAargau[2001-2011])","v":38},0.44938704028021026,{"$f":"_xlfn.RANK.EQ(tblAargau[[#This Row],[1981-2011]],tblAargau[1981-2011])","v":98},6.6,{"$f":"_xlfn.RANK.EQ(tblAargau[[#This Row],[Fläche in km²]],tblAargau[Fläche in km²])","v":81},627,{"$f":"_xlfn.RANK.EQ(tblAargau[[#This Row],[Einwohner/km²]],tblAargau[Einwohner/km²])","v":53},97,{"$f":"_xlfn.RANK.EQ(tblAargau[[#This Row],[Tax]],tblAargau[Tax],1)","v":41}]
["Muhen","Aarau",2508,2555,2562,2564,2564,2556,2579,2570,2563,2623,2718,2705,2786,2815,2846,2916,2922,2969,3013,3064,3063,3122,3187,3224,3230,3220,3298,3449,3514,3569,3682,{"$f":"_xlfn.RANK.EQ(tblAargau[[#This Row],[2011]],tblAargau[2011])","v":55},4.5853269537480035E-2,0.12729948491537901,0.20208945478289264,{"$f":"_xlfn.RANK.EQ(tblAargau[[#This Row],[2001-2011]],tblAargau[2001-2011])","v":37},0.46810207336523124,{"$f":"_xlfn.RANK.EQ(tblAargau[[#This Row],[1981-2011]],tblAargau[1981-2011])","v":91},7.02,{"$f":"_xlfn.RANK.EQ(tblAargau[[#This Row],[Fläche in km²]],tblAargau[Fläche in km²])","v":76},525,{"$f":"_xlfn.RANK.EQ(tblAargau[[#This Row],[Einwohner/km²]],tblAargau[Einwohner/km²])","v":67},115,{"$f":"_xlfn.RANK.EQ(tblAargau[[#This Row],[Tax]],tblAargau[Tax],1)","v":150}]
["Mühlau","Muri",606,628,617,630,638,663,670,743,757,768,814,866,912,939,969,939,982,983,1002,992,980,1007,981,986,1002,1001,998,990,987,1008,1020,{"$f":"_xlfn.RANK.EQ(tblAargau[[#This Row],[2011]],tblAargau[2011])","v":151},0.26732673267326734,0.21867321867321876,4.081632653061229E-2,{"$f":"_xlfn.RANK.EQ(tblAargau[[#This Row],[2001-2011]],tblAargau[2001-2011])","v":169},0.68316831683168311,{"$f":"_xlfn.RANK.EQ(tblAargau[[#This Row],[1981-2011]],tblAargau[1981-2011])","v":53},5.52,{"$f":"_xlfn.RANK.EQ(tblAargau[[#This Row],[Fläche in km²]],tblAargau[Fläche in km²])","v":106},185,{"$f":"_xlfn.RANK.EQ(tblAargau[[#This Row],[Einwohner/km²]],tblAargau[Einwohner/km²])","v":161},117,{"$f":"_xlfn.RANK.EQ(tblAargau[[#This Row],[Tax]],tblAargau[Tax],1)","v":168}]
["Mülligen","Brugg",459,449,457,475,529,544,581,605,601,635,659,668,701,718,733,736,774,779,799,789,824,812,836,833,841,874,908,917,941,944,965,{"$f":"_xlfn.RANK.EQ(tblAargau[[#This Row],[2011]],tblAargau[2011])","v":159},0.38344226579520702,0.19726858877086495,0.17111650485436902,{"$f":"_xlfn.RANK.EQ(tblAargau[[#This Row],[2001-2011]],tblAargau[2001-2011])","v":61},1.10239651416122,{"$f":"_xlfn.RANK.EQ(tblAargau[[#This Row],[1981-2011]],tblAargau[1981-2011])","v":18},3.16,{"$f":"_xlfn.RANK.EQ(tblAargau[[#This Row],[Fläche in km²]],tblAargau[Fläche in km²])","v":182},305,{"$f":"_xlfn.RANK.EQ(tblAargau[[#This Row],[Einwohner/km²]],tblAargau[Einwohner/km²])","v":116},109,{"$f":"_xlfn.RANK.EQ(tblAargau[[#This Row],[Tax]],tblAargau[Tax],1)","v":112}]
["Mumpf","Rheinfelden",796,817,816,839,821,808,807,800,824,820,793,795,832,859,938,964,960,968,987,1074,1121,1182,1245,1252,1254,1234,1250,1292,1295,1296,1259,{"$f":"_xlfn.RANK.EQ(tblAargau[[#This Row],[2011]],tblAargau[2011])","v":134},3.015075376884413E-2,0.35435056746532156,0.1231043710972346,{"$f":"_xlfn.RANK.EQ(tblAargau[[#This Row],[2001-2011]],tblAargau[2001-2011])","v":102},0.58165829145728654,{"$f":"_xlfn.RANK.EQ(tblAargau[[#This Row],[1981-2011]],tblAargau[1981-2011])","v":69},3.1,{"$f":"_xlfn.RANK.EQ(tblAargau[[#This Row],[Fläche in km²]],tblAargau[Fläche in km²])","v":183},406,{"$f":"_xlfn.RANK.EQ(tblAargau[[#This Row],[Einwohner/km²]],tblAargau[Einwohner/km²])","v":88},122,{"$f":"_xlfn.RANK.EQ(tblAargau[[#This Row],[Tax]],tblAargau[Tax],1)","v":206}]
["Münchwilen (AG)","Laufenburg",616,611,601,600,598,608,607,617,622,614,616,624,612,600,596,601,581,581,578,591,601,603,608,604,608,659,695,710,720,745,831,{"$f":"_xlfn.RANK.EQ(tblAargau[[#This Row],[2011]],tblAargau[2011])","v":172},-3.2467532467532756E-3,-4.0584415584415612E-2,0.3826955074875209,{"$f":"_xlfn.RANK.EQ(tblAargau[[#This Row],[2001-2011]],tblAargau[2001-2011])","v":5},0.34902597402597402,{"$f":"_xlfn.RANK.EQ(tblAargau[[#This Row],[1981-2011]],tblAargau[1981-2011])","v":136},2.46,{"$f":"_xlfn.RANK.EQ(tblAargau[[#This Row],[Fläche in km²]],tblAargau[Fläche in km²])","v":200},338,{"$f":"_xlfn.RANK.EQ(tblAargau[[#This Row],[Einwohner/km²]],tblAargau[Einwohner/km²])","v":103},96,{"$f":"_xlfn.RANK.EQ(tblAargau[[#This Row],[Tax]],tblAargau[Tax],1)","v":40}]
["Murgenthal","Zofingen",2529,2547,2558,2529,2526,2535,2554,2630,2656,2671,2765,2839,2898,2865,2796,2798,2816,2791,2765,2722,2736,2771,2804,2830,2798,2784,2803,2809,2801,2793,2832,{"$f":"_xlfn.RANK.EQ(tblAargau[[#This Row],[2011]],tblAargau[2011])","v":74},5.6148675365757184E-2,-1.5551537070524368E-2,3.5087719298245723E-2,{"$f":"_xlfn.RANK.EQ(tblAargau[[#This Row],[2001-2011]],tblAargau[2001-2011])","v":172},0.11981020166073542,{"$f":"_xlfn.RANK.EQ(tblAargau[[#This Row],[1981-2011]],tblAargau[1981-2011])","v":204},18.649999999999999,{"$f":"_xlfn.RANK.EQ(tblAargau[[#This Row],[Fläche in km²]],tblAargau[Fläche in km²])","v":4},152,{"$f":"_xlfn.RANK.EQ(tblAargau[[#This Row],[Einwohner/km²]],tblAargau[Einwohner/km²])","v":176},118,{"$f":"_xlfn.RANK.EQ(tblAargau[[#This Row],[Tax]],tblAargau[Tax],1)","v":178}]
["Muri (AG)","Muri",5361,5404,5446,5506,5560,5636,5756,5814,5830,5871,5557,5639,5720,5747,5875,5888,5975,6070,6086,6204,6290,6300,6327,6400,6499,6565,6633,6760,6827,6948,7176,{"$f":"_xlfn.RANK.EQ(tblAargau[[#This Row],[2011]],tblAargau[2011])","v":19},9.5131505316172316E-2,0.11642972827064968,0.14085850556438784,{"$f":"_xlfn.RANK.EQ(tblAargau[[#This Row],[2001-2011]],tblAargau[2001-2011])","v":85},0.33855623950755453,{"$f":"_xlfn.RANK.EQ(tblAargau[[#This Row],[1981-2011]],tblAargau[1981-2011])","v":142},12.34,{"$f":"_xlfn.RANK.EQ(tblAargau[[#This Row],[Fläche in km²]],tblAargau[Fläche in km²])","v":17},582,{"$f":"_xlfn.RANK.EQ(tblAargau[[#This Row],[Einwohner/km²]],tblAargau[Einwohner/km²])","v":58},103,{"$f":"_xlfn.RANK.EQ(tblAargau[[#This Row],[Tax]],tblAargau[Tax],1)","v":81}]
["Neuenhof","Baden",7468,7784,7818,7791,7786,7779,7745,7635,7637,7630,7641,7563,7577,7578,7507,7448,7422,7520,7630,7580,7576,7526,7579,7654,7746,7786,7873,7911,7954,8078,8300,{"$f":"_xlfn.RANK.EQ(tblAargau[[#This Row],[2011]],tblAargau[2011])","v":14},2.1692554900910599E-2,-7.9832482659337733E-3,9.5564941921858493E-2,{"$f":"_xlfn.RANK.EQ(tblAargau[[#This Row],[2001-2011]],tblAargau[2001-2011])","v":126},0.11140867702196044,{"$f":"_xlfn.RANK.EQ(tblAargau[[#This Row],[1981-2011]],tblAargau[1981-2011])","v":206},5.38,{"$f":"_xlfn.RANK.EQ(tblAargau[[#This Row],[Fläche in km²]],tblAargau[Fläche in km²])","v":110},1543,{"$f":"_xlfn.RANK.EQ(tblAargau[[#This Row],[Einwohner/km²]],tblAargau[Einwohner/km²])","v":6},98,{"$f":"_xlfn.RANK.EQ(tblAargau[[#This Row],[Tax]],tblAargau[Tax],1)","v":44}]
["Niederlenz","Lenzburg",3395,3422,3394,3364,3407,3365,3336,3333,3399,3487,3528,3566,3608,3665,3648,3676,3763,3793,3839,3839,3903,3924,3930,3938,3979,4005,4021,4013,4073,4198,4263,{"$f":"_xlfn.RANK.EQ(tblAargau[[#This Row],[2011]],tblAargau[2011])","v":40},2.7098674521354837E-2,8.8151927437641664E-2,9.2236740968485886E-2,{"$f":"_xlfn.RANK.EQ(tblAargau[[#This Row],[2001-2011]],tblAargau[2001-2011])","v":129},0.25567010309278349,{"$f":"_xlfn.RANK.EQ(tblAargau[[#This Row],[1981-2011]],tblAargau[1981-2011])","v":169},3.3,{"$f":"_xlfn.RANK.EQ(tblAargau[[#This Row],[Fläche in km²]],tblAargau[Fläche in km²])","v":174},1292,{"$f":"_xlfn.RANK.EQ(tblAargau[[#This Row],[Einwohner/km²]],tblAargau[Einwohner/km²])","v":13},120,{"$f":"_xlfn.RANK.EQ(tblAargau[[#This Row],[Tax]],tblAargau[Tax],1)","v":195}]
["Niederrohrdorf","Baden",2433,2415,2431,2444,2492,2474,2529,2494,2529,2544,2548,2532,2510,2512,2477,2494,2515,2525,2465,2453,2510,2514,2549,2634,2673,2794,3012,3243,3393,3456,3563,{"$f":"_xlfn.RANK.EQ(tblAargau[[#This Row],[2011]],tblAargau[2011])","v":58},4.562268803945746E-2,-3.7284144427001564E-2,0.41952191235059755,{"$f":"_xlfn.RANK.EQ(tblAargau[[#This Row],[2001-2011]],tblAargau[2001-2011])","v":3},0.46444718454582823,{"$f":"_xlfn.RANK.EQ(tblAargau[[#This Row],[1981-2011]],tblAargau[1981-2011])","v":92},3.33,{"$f":"_xlfn.RANK.EQ(tblAargau[[#This Row],[Fläche in km²]],tblAargau[Fläche in km²])","v":173},1070,{"$f":"_xlfn.RANK.EQ(tblAargau[[#This Row],[Einwohner/km²]],tblAargau[Einwohner/km²])","v":18},95,{"$f":"_xlfn.RANK.EQ(tblAargau[[#This Row],[Tax]],tblAargau[Tax],1)","v":30}]
["Niederwil (AG)","Bremgarten",1643,1632,1622,1655,1711,1768,1913,1996,2049,2074,1923,1982,1978,1998,2108,2171,2125,2145,2203,2199,2222,2219,2220,2239,2278,2288,2333,2374,2331,2343,2440,{"$f":"_xlfn.RANK.EQ(tblAargau[[#This Row],[2011]],tblAargau[2011])","v":84},0.2623250152160681,0.14352574102964111,9.8109810981098056E-2,{"$f":"_xlfn.RANK.EQ(tblAargau[[#This Row],[2001-2011]],tblAargau[2001-2011])","v":125},0.48508825319537441,{"$f":"_xlfn.RANK.EQ(tblAargau[[#This Row],[1981-2011]],tblAargau[1981-2011])","v":90},6.15,{"$f":"_xlfn.RANK.EQ(tblAargau[[#This Row],[Fläche in km²]],tblAargau[Fläche in km²])","v":91},397,{"$f":"_xlfn.RANK.EQ(tblAargau[[#This Row],[Einwohner/km²]],tblAargau[Einwohner/km²])","v":93},99,{"$f":"_xlfn.RANK.EQ(tblAargau[[#This Row],[Tax]],tblAargau[Tax],1)","v":53}]
["Oberbözberg","Brugg",305,313,301,320,331,326,339,328,365,383,415,421,432,453,475,483,520,521,541,546,527,525,533,517,517,506,494,478,494,492,499,{"$f":"_xlfn.RANK.EQ(tblAargau[[#This Row],[2011]],tblAargau[2011])","v":197},0.25573770491803272,0.31566265060240961,-5.313092979127132E-2,{"$f":"_xlfn.RANK.EQ(tblAargau[[#This Row],[2001-2011]],tblAargau[2001-2011])","v":212},0.63606557377049189,{"$f":"_xlfn.RANK.EQ(tblAargau[[#This Row],[1981-2011]],tblAargau[1981-2011])","v":62},5.45,{"$f":"_xlfn.RANK.EQ(tblAargau[[#This Row],[Fläche in km²]],tblAargau[Fläche in km²])","v":109},92,{"$f":"_xlfn.RANK.EQ(tblAargau[[#This Row],[Einwohner/km²]],tblAargau[Einwohner/km²])","v":204},110,{"$f":"_xlfn.RANK.EQ(tblAargau[[#This Row],[Tax]],tblAargau[Tax],1)","v":117}]
["Oberentfelden","Aarau",5837,5945,6072,6179,6235,6451,6559,6561,6594,6594,6610,6628,6646,6715,6706,6644,6583,6580,6591,6637,6754,6816,6928,7057,7110,7130,7072,7226,7220,7366,7618,{"$f":"_xlfn.RANK.EQ(tblAargau[[#This Row],[2011]],tblAargau[2011])","v":17},{"$f":"IFERROR(L130/C130-1,0)","v":0.12968990919993151},{"$f":"IFERROR(V130/M130-1,0)","v":4.0847201210287842E-3},{"$f":"IFERROR(AG130/W130-1,0)","v":0.12792419307077285},{"$f":"_xlfn.RANK.EQ(tblAargau[[#This Row],[2001-2011]],tblAargau[2001-2011])","v":95},{"$f":"IFERROR(AG130/C130-1,0)","v":0.30512249443207118},{"$f":"_xlfn.RANK.EQ(tblAargau[[#This Row],[1981-2011]],tblAargau[1981-2011])","v":153},7.16,{"$f":"_xlfn.RANK.EQ(tblAargau[[#This Row],[Fläche in km²]],tblAargau[Fläche in km²])","v":69},1064,{"$f":"_xlfn.RANK.EQ(tblAargau[[#This Row],[Einwohner/km²]],tblAargau[Einwohner/km²])","v":19},108,{"$f":"_xlfn.RANK.EQ(tblAargau[[#This Row],[Tax]],tblAargau[Tax],1)","v":105}]
["Oberflachs","Brugg",476,475,465,464,469,454,463,456,455,462,433,431,434,430,420,431,438,440,443,436,436,439,449,456,469,483,485,489,493,497,475,{"$f":"_xlfn.RANK.EQ(tblAargau[[#This Row],[2011]],tblAargau[2011])","v":198},-2.9411764705882359E-2,6.9284064665127154E-3,8.9449541284403633E-2,{"$f":"_xlfn.RANK.EQ(tblAargau[[#This Row],[2001-2011]],tblAargau[2001-2011])","v":131},-2.1008403361344463E-3,{"$f":"_xlfn.RANK.EQ(tblAargau[[#This Row],[1981-2011]],tblAargau[1981-2011])","v":216},3.38,{"$f":"_xlfn.RANK.EQ(tblAargau[[#This Row],[Fläche in km²]],tblAargau[Fläche in km²])","v":170},141,{"$f":"_xlfn.RANK.EQ(tblAargau[[#This Row],[Einwohner/km²]],tblAargau[Einwohner/km²])","v":182},114,{"$f":"_xlfn.RANK.EQ(tblAargau[[#This Row],[Tax]],tblAargau[Tax],1)","v":144}]
["Oberhof","Laufenburg",408,409,414,418,413,425,428,427,449,448,475,483,487,481,492,497,512,508,513,512,530,541,542,557,571,569,573,562,579,571,568,{"$f":"_xlfn.RANK.EQ(tblAargau[[#This Row],[2011]],tblAargau[2011])","v":194},9.8039215686274606E-2,7.7894736842105239E-2,7.1698113207547154E-2,{"$f":"_xlfn.RANK.EQ(tblAargau[[#This Row],[2001-2011]],tblAargau[2001-2011])","v":144},0.39215686274509798,{"$f":"_xlfn.RANK.EQ(tblAargau[[#This Row],[1981-2011]],tblAargau[1981-2011])","v":116},8.2100000000000009,{"$f":"_xlfn.RANK.EQ(tblAargau[[#This Row],[Fläche in km²]],tblAargau[Fläche in km²])","v":60},69,{"$f":"_xlfn.RANK.EQ(tblAargau[[#This Row],[Einwohner/km²]],tblAargau[Einwohner/km²])","v":212},120,{"$f":"_xlfn.RANK.EQ(tblAargau[[#This Row],[Tax]],tblAargau[Tax],1)","v":195}]
["Oberkulm","Kulm",1880,1922,1960,1994,2016,2048,1984,2016,2046,2096,2172,2158,2212,2219,2230,2266,2252,2246,2240,2230,2248,2259,2264,2338,2373,2379,2354,2382,2396,2438,2477,{"$f":"_xlfn.RANK.EQ(tblAargau[[#This Row],[2011]],tblAargau[2011])","v":83},0.11489361702127665,2.6703499079189674E-2,0.10186832740213525,{"$f":"_xlfn.RANK.EQ(tblAargau[[#This Row],[2001-2011]],tblAargau[2001-2011])","v":123},0.31755319148936167,{"$f":"_xlfn.RANK.EQ(tblAargau[[#This Row],[1981-2011]],tblAargau[1981-2011])","v":149},9.41,{"$f":"_xlfn.RANK.EQ(tblAargau[[#This Row],[Fläche in km²]],tblAargau[Fläche in km²])","v":42},263,{"$f":"_xlfn.RANK.EQ(tblAargau[[#This Row],[Einwohner/km²]],tblAargau[Einwohner/km²])","v":126},114,{"$f":"_xlfn.RANK.EQ(tblAargau[[#This Row],[Tax]],tblAargau[Tax],1)","v":144}]
["Oberlunkhofen","Bremgarten",744,765,776,819,866,884,902,963,1025,1073,1091,1108,1142,1214,1286,1315,1364,1367,1415,1439,1490,1518,1580,1637,1679,1687,1724,1818,1844,1915,1942,{"$f":"_xlfn.RANK.EQ(tblAargau[[#This Row],[2011]],tblAargau[2011])","v":99},0.44220430107526876,0.3189734188817599,0.30335570469798667,{"$f":"_xlfn.RANK.EQ(tblAargau[[#This Row],[2001-2011]],tblAargau[2001-2011])","v":15},1.610215053763441,{"$f":"_xlfn.RANK.EQ(tblAargau[[#This Row],[1981-2011]],tblAargau[1981-2011])","v":7},3.25,{"$f":"_xlfn.RANK.EQ(tblAargau[[#This Row],[Fläche in km²]],tblAargau[Fläche in km²])","v":179},598,{"$f":"_xlfn.RANK.EQ(tblAargau[[#This Row],[Einwohner/km²]],tblAargau[Einwohner/km²])","v":55},75,{"$f":"_xlfn.RANK.EQ(tblAargau[[#This Row],[Tax]],tblAargau[Tax],1)","v":4}]
["Obermumpf","Rheinfelden",727,735,763,754,763,767,773,775,794,823,897,936,978,1021,1034,1025,1005,1004,1016,998,1006,1039,1059,1054,1040,1022,1018,1005,994,1010,1008,{"$f":"_xlfn.RANK.EQ(tblAargau[[#This Row],[2011]],tblAargau[2011])","v":152},0.13204951856946345,0.11259754738015615,1.9880715705764551E-3,{"$f":"_xlfn.RANK.EQ(tblAargau[[#This Row],[2001-2011]],tblAargau[2001-2011])","v":196},0.38651994497936726,{"$f":"_xlfn.RANK.EQ(tblAargau[[#This Row],[1981-2011]],tblAargau[1981-2011])","v":122},5.03,{"$f":"_xlfn.RANK.EQ(tblAargau[[#This Row],[Fläche in km²]],tblAargau[Fläche in km²])","v":121},200,{"$f":"_xlfn.RANK.EQ(tblAargau[[#This Row],[Einwohner/km²]],tblAargau[Einwohner/km²])","v":153},125,{"$f":"_xlfn.RANK.EQ(tblAargau[[#This Row],[Tax]],tblAargau[Tax],1)","v":215}]
["Oberrohrdorf","Baden",2839,2864,2930,2960,2959,2956,3041,3120,3184,3253,3336,3353,3396,3393,3365,3300,3271,3301,3346,3402,3458,3529,3491,3454,3502,3493,3621,3688,3786,3873,3901,{"$f":"_xlfn.RANK.EQ(tblAargau[[#This Row],[2011]],tblAargau[2011])","v":49},0.14582599506868621,1.9784172661870603E-2,0.12810873337189133,{"$f":"_xlfn.RANK.EQ(tblAargau[[#This Row],[2001-2011]],tblAargau[2001-2011])","v":94},0.37407537865445573,{"$f":"_xlfn.RANK.EQ(tblAargau[[#This Row],[1981-2011]],tblAargau[1981-2011])","v":124},4.29,{"$f":"_xlfn.RANK.EQ(tblAargau[[#This Row],[Fläche in km²]],tblAargau[Fläche in km²])","v":143},909,{"$f":"_xlfn.RANK.EQ(tblAargau[[#This Row],[Einwohner/km²]],tblAargau[Einwohner/km²])","v":30},83,{"$f":"_xlfn.RANK.EQ(tblAargau[[#This Row],[Tax]],tblAargau[Tax],1)","v":7}]
["Oberrüti","Muri",512,532,545,573,578,562,663,695,682,711,746,758,799,874,903,948,995,1027,1082,1108,1164,1165,1199,1206,1206,1216,1208,1216,1263,1341,1384,{"$f":"_xlfn.RANK.EQ(tblAargau[[#This Row],[2011]],tblAargau[2011])","v":124},0.388671875,0.48525469168900814,0.18900343642611683,{"$f":"_xlfn.RANK.EQ(tblAargau[[#This Row],[2001-2011]],tblAargau[2001-2011])","v":46},1.703125,{"$f":"_xlfn.RANK.EQ(tblAargau[[#This Row],[1981-2011]],tblAargau[1981-2011])","v":4},5.37,{"$f":"_xlfn.RANK.EQ(tblAargau[[#This Row],[Fläche in km²]],tblAargau[Fläche in km²])","v":111},258,{"$f":"_xlfn.RANK.EQ(tblAargau[[#This Row],[Einwohner/km²]],tblAargau[Einwohner/km²])","v":129},112,{"$f":"_xlfn.RANK.EQ(tblAargau[[#This Row],[Tax]],tblAargau[Tax],1)","v":130}]
["Obersiggenthal","Baden",7547,7546,7540,7514,7481,7463,7440,7320,7386,7326,7428,7532,7516,7534,7560,7520,7462,7407,7458,7465,7683,7688,7715,7756,7871,8019,7968,8068,8090,8126,8346,{"$f":"_xlfn.RANK.EQ(tblAargau[[#This Row],[2011]],tblAargau[2011])","v":13},-2.9283158871074577E-2,4.9811523963381177E-3,8.6294416243654748E-2,{"$f":"_xlfn.RANK.EQ(tblAargau[[#This Row],[2001-2011]],tblAargau[2001-2011])","v":135},0.10586988207234671,{"$f":"_xlfn.RANK.EQ(tblAargau[[#This Row],[1981-2011]],tblAargau[1981-2011])","v":208},8.36,{"$f":"_xlfn.RANK.EQ(tblAargau[[#This Row],[Fläche in km²]],tblAargau[Fläche in km²])","v":56},998,{"$f":"_xlfn.RANK.EQ(tblAargau[[#This Row],[Einwohner/km²]],tblAargau[Einwohner/km²])","v":24},98,{"$f":"_xlfn.RANK.EQ(tblAargau[[#This Row],[Tax]],tblAargau[Tax],1)","v":44}]
["Oberwil-Lieli","Bremgarten",1266,1357,1383,1405,1450,1458,1487,1525,1549,1597,1616,1626,1675,1706,1715,1711,1660,1699,1729,1747,1783,1866,1941,1936,1945,1975,2049,2080,2101,2146,2157,{"$f":"_xlfn.RANK.EQ(tblAargau[[#This Row],[2011]],tblAargau[2011])","v":89},0.26145339652448651,8.106435643564347E-2,0.20975883342680879,{"$f":"_xlfn.RANK.EQ(tblAargau[[#This Row],[2001-2011]],tblAargau[2001-2011])","v":32},0.70379146919431279,{"$f":"_xlfn.RANK.EQ(tblAargau[[#This Row],[1981-2011]],tblAargau[1981-2011])","v":47},5.35,{"$f":"_xlfn.RANK.EQ(tblAargau[[#This Row],[Fläche in km²]],tblAargau[Fläche in km²])","v":113},403,{"$f":"_xlfn.RANK.EQ(tblAargau[[#This Row],[Einwohner/km²]],tblAargau[Einwohner/km²])","v":90},70,{"$f":"_xlfn.RANK.EQ(tblAargau[[#This Row],[Tax]],tblAargau[Tax],1)","v":2}]
["Oeschgen","Laufenburg",640,645,645,641,653,685,693,696,701,720,753,762,796,800,779,753,777,780,800,802,813,805,820,843,851,857,861,901,891,897,908,{"$f":"_xlfn.RANK.EQ(tblAargau[[#This Row],[2011]],tblAargau[2011])","v":164},0.125,6.5073041168658641E-2,0.11685116851168509,{"$f":"_xlfn.RANK.EQ(tblAargau[[#This Row],[2001-2011]],tblAargau[2001-2011])","v":112},0.41874999999999996,{"$f":"_xlfn.RANK.EQ(tblAargau[[#This Row],[1981-2011]],tblAargau[1981-2011])","v":107},4.38,{"$f":"_xlfn.RANK.EQ(tblAargau[[#This Row],[Fläche in km²]],tblAargau[Fläche in km²])","v":141},207,{"$f":"_xlfn.RANK.EQ(tblAargau[[#This Row],[Einwohner/km²]],tblAargau[Einwohner/km²])","v":149},115,{"$f":"_xlfn.RANK.EQ(tblAargau[[#This Row],[Tax]],tblAargau[Tax],1)","v":150}]
["Oftringen","Zofingen",8964,9027,9027,9103,9038,9200,9299,9339,9484,9526,9759,9767,9885,9899,9978,9921,9927,10097,10126,10220,10233,10194,10313,10512,10635,10882,11158,11665,11988,12221,12618,{"$f":"_xlfn.RANK.EQ(tblAargau[[#This Row],[2011]],tblAargau[2011])","v":5},6.2695225345827721E-2,4.7238446562147818E-2,0.23306948109058934,{"$f":"_xlfn.RANK.EQ(tblAargau[[#This Row],[2001-2011]],tblAargau[2001-2011])","v":25},0.40763052208835338,{"$f":"_xlfn.RANK.EQ(tblAargau[[#This Row],[1981-2011]],tblAargau[1981-2011])","v":111},12.85,{"$f":"_xlfn.RANK.EQ(tblAargau[[#This Row],[Fläche in km²]],tblAargau[Fläche in km²])","v":13},982,{"$f":"_xlfn.RANK.EQ(tblAargau[[#This Row],[Einwohner/km²]],tblAargau[Einwohner/km²])","v":26},108,{"$f":"_xlfn.RANK.EQ(tblAargau[[#This Row],[Tax]],tblAargau[Tax],1)","v":105}]
["Olsberg","Rheinfelden",293,301,305,316,321,318,312,325,329,335,319,314,322,312,322,323,330,338,339,350,344,336,341,352,358,366,355,359,360,367,371,{"$f":"_xlfn.RANK.EQ(tblAargau[[#This Row],[2011]],tblAargau[2011])","v":205},0.14334470989761083,9.7178683385579889E-2,7.8488372093023173E-2,{"$f":"_xlfn.RANK.EQ(tblAargau[[#This Row],[2001-2011]],tblAargau[2001-2011])","v":140},0.2662116040955631,{"$f":"_xlfn.RANK.EQ(tblAargau[[#This Row],[1981-2011]],tblAargau[1981-2011])","v":165},4.62,{"$f":"_xlfn.RANK.EQ(tblAargau[[#This Row],[Fläche in km²]],tblAargau[Fläche in km²])","v":132},80,{"$f":"_xlfn.RANK.EQ(tblAargau[[#This Row],[Einwohner/km²]],tblAargau[Einwohner/km²])","v":210},100,{"$f":"_xlfn.RANK.EQ(tblAargau[[#This Row],[Tax]],tblAargau[Tax],1)","v":60}]
["Othmarsingen","Lenzburg",1693,1672,1650,1670,1632,1618,1718,1754,1784,1834,1927,1947,2012,2073,2126,2116,2124,2137,2161,2162,2133,2125,2145,2161,2170,2191,2220,2291,2359,2354,2426,{"$f":"_xlfn.RANK.EQ(tblAargau[[#This Row],[2011]],tblAargau[2011])","v":85},8.328411104548139E-2,0.12195121951219523,0.1373652133145804,{"$f":"_xlfn.RANK.EQ(tblAargau[[#This Row],[2001-2011]],tblAargau[2001-2011])","v":89},0.43295924394565866,{"$f":"_xlfn.RANK.EQ(tblAargau[[#This Row],[1981-2011]],tblAargau[1981-2011])","v":101},4.7300000000000004,{"$f":"_xlfn.RANK.EQ(tblAargau[[#This Row],[Fläche in km²]],tblAargau[Fläche in km²])","v":131},513,{"$f":"_xlfn.RANK.EQ(tblAargau[[#This Row],[Einwohner/km²]],tblAargau[Einwohner/km²])","v":69},112,{"$f":"_xlfn.RANK.EQ(tblAargau[[#This Row],[Tax]],tblAargau[Tax],1)","v":130}]
["Reinach (AG)","Kulm",5772,5795,5826,5912,5901,5935,6105,6285,6464,6626,6863,7150,7165,7297,7339,7285,7294,7271,7404,7311,7355,7460,7582,7580,7670,7664,7670,7810,7926,7956,8004,{"$f":"_xlfn.RANK.EQ(tblAargau[[#This Row],[2011]],tblAargau[2011])","v":15},0.14795564795564786,6.5277575404342203E-2,8.8239292997960517E-2,{"$f":"_xlfn.RANK.EQ(tblAargau[[#This Row],[2001-2011]],tblAargau[2001-2011])","v":133},0.3866943866943866,{"$f":"_xlfn.RANK.EQ(tblAargau[[#This Row],[1981-2011]],tblAargau[1981-2011])","v":121},9.4700000000000006,{"$f":"_xlfn.RANK.EQ(tblAargau[[#This Row],[Fläche in km²]],tblAargau[Fläche in km²])","v":41},845,{"$f":"_xlfn.RANK.EQ(tblAargau[[#This Row],[Einwohner/km²]],tblAargau[Einwohner/km²])","v":36},116,{"$f":"_xlfn.RANK.EQ(tblAargau[[#This Row],[Tax]],tblAargau[Tax],1)","v":164}]
["Reitnau","Zofingen",878,891,886,886,906,898,918,918,922,915,957,969,988,1020,1050,1097,1132,1135,1124,1143,1159,1164,1149,1143,1157,1162,1166,1177,1195,1218,1222,{"$f":"_xlfn.RANK.EQ(tblAargau[[#This Row],[2011]],tblAargau[2011])","v":137},4.2141230068337032E-2,0.19435736677115978,5.4357204486626509E-2,{"$f":"_xlfn.RANK.EQ(tblAargau[[#This Row],[2001-2011]],tblAargau[2001-2011])","v":157},0.39179954441913445,{"$f":"_xlfn.RANK.EQ(tblAargau[[#This Row],[1981-2011]],tblAargau[1981-2011])","v":117},5.81,{"$f":"_xlfn.RANK.EQ(tblAargau[[#This Row],[Fläche in km²]],tblAargau[Fläche in km²])","v":97},210,{"$f":"_xlfn.RANK.EQ(tblAargau[[#This Row],[Einwohner/km²]],tblAargau[Einwohner/km²])","v":146},117,{"$f":"_xlfn.RANK.EQ(tblAargau[[#This Row],[Tax]],tblAargau[Tax],1)","v":168}]
["Rekingen (AG)","Zurzach",764,760,727,724,721,679,673,780,882,907,903,948,977,974,1006,998,997,1008,1007,1003,1049,1032,1026,942,946,958,950,976,962,966,992,{"$f":"_xlfn.RANK.EQ(tblAargau[[#This Row],[2011]],tblAargau[2011])","v":156},0.18717277486910988,0.1107419712070874,-5.4337464251668299E-2,{"$f":"_xlfn.RANK.EQ(tblAargau[[#This Row],[2001-2011]],tblAargau[2001-2011])","v":214},0.29842931937172779,{"$f":"_xlfn.RANK.EQ(tblAargau[[#This Row],[1981-2011]],tblAargau[1981-2011])","v":157},3.1,{"$f":"_xlfn.RANK.EQ(tblAargau[[#This Row],[Fläche in km²]],tblAargau[Fläche in km²])","v":183},320,{"$f":"_xlfn.RANK.EQ(tblAargau[[#This Row],[Einwohner/km²]],tblAargau[Einwohner/km²])","v":114},125,{"$f":"_xlfn.RANK.EQ(tblAargau[[#This Row],[Tax]],tblAargau[Tax],1)","v":215}]
["Remetschwil","Baden",808,823,841,872,935,1052,1084,1113,1137,1189,1154,1180,1240,1311,1491,1565,1588,1663,1711,1762,1773,1855,1893,1892,1898,1921,1915,1943,1958,1989,2042,{"$f":"_xlfn.RANK.EQ(tblAargau[[#This Row],[2011]],tblAargau[2011])","v":94},0.47153465346534662,0.52686308492201039,0.15172024816694862,{"$f":"_xlfn.RANK.EQ(tblAargau[[#This Row],[2001-2011]],tblAargau[2001-2011])","v":75},1.527227722772277,{"$f":"_xlfn.RANK.EQ(tblAargau[[#This Row],[1981-2011]],tblAargau[1981-2011])","v":8},3.89,{"$f":"_xlfn.RANK.EQ(tblAargau[[#This Row],[Fläche in km²]],tblAargau[Fläche in km²])","v":156},525,{"$f":"_xlfn.RANK.EQ(tblAargau[[#This Row],[Einwohner/km²]],tblAargau[Einwohner/km²])","v":67},89,{"$f":"_xlfn.RANK.EQ(tblAargau[[#This Row],[Tax]],tblAargau[Tax],1)","v":19}]
["Remigen","Brugg",652,685,724,735,745,776,804,869,927,979,1008,1015,1034,1071,1066,1090,1067,1063,1072,1063,1046,1044,1026,1024,1021,1005,1014,1017,1030,1043,1051,{"$f":"_xlfn.RANK.EQ(tblAargau[[#This Row],[2011]],tblAargau[2011])","v":146},0.50153374233128845,5.4563492063492092E-2,4.7801147227533036E-3,{"$f":"_xlfn.RANK.EQ(tblAargau[[#This Row],[2001-2011]],tblAargau[2001-2011])","v":195},0.61196319018404899,{"$f":"_xlfn.RANK.EQ(tblAargau[[#This Row],[1981-2011]],tblAargau[1981-2011])","v":63},7.87,{"$f":"_xlfn.RANK.EQ(tblAargau[[#This Row],[Fläche in km²]],tblAargau[Fläche in km²])","v":62},134,{"$f":"_xlfn.RANK.EQ(tblAargau[[#This Row],[Einwohner/km²]],tblAargau[Einwohner/km²])","v":184},104,{"$f":"_xlfn.RANK.EQ(tblAargau[[#This Row],[Tax]],tblAargau[Tax],1)","v":87}]
["Rheinfelden","Rheinfelden",9529,9491,9448,9448,9514,9529,9540,9725,9735,9751,9756,9896,10044,10140,10205,10281,10255,10335,10496,10566,10727,10720,10730,10774,10859,10870,10881,11206,11596,11872,12074,{"$f":"_xlfn.RANK.EQ(tblAargau[[#This Row],[2011]],tblAargau[2011])","v":6},2.3297302969881306E-2,8.302583025830268E-2,0.12557098909294306,{"$f":"_xlfn.RANK.EQ(tblAargau[[#This Row],[2001-2011]],tblAargau[2001-2011])","v":100},0.26707944170427123,{"$f":"_xlfn.RANK.EQ(tblAargau[[#This Row],[1981-2011]],tblAargau[1981-2011])","v":164},16.03,{"$f":"_xlfn.RANK.EQ(tblAargau[[#This Row],[Fläche in km²]],tblAargau[Fläche in km²])","v":7},753,{"$f":"_xlfn.RANK.EQ(tblAargau[[#This Row],[Einwohner/km²]],tblAargau[Einwohner/km²])","v":44},100,{"$f":"_xlfn.RANK.EQ(tblAargau[[#This Row],[Tax]],tblAargau[Tax],1)","v":60}]
["Rietheim","Zurzach",433,436,435,430,440,439,423,445,432,444,445,477,544,577,574,593,594,616,609,608,627,675,686,682,677,666,697,713,704,715,733,{"$f":"_xlfn.RANK.EQ(tblAargau[[#This Row],[2011]],tblAargau[2011])","v":182},2.5404157043879882E-2,0.36629213483146073,0.16905901116427424,{"$f":"_xlfn.RANK.EQ(tblAargau[[#This Row],[2001-2011]],tblAargau[2001-2011])","v":63},0.69284064665127021,{"$f":"_xlfn.RANK.EQ(tblAargau[[#This Row],[1981-2011]],tblAargau[1981-2011])","v":49},3.93,{"$f":"_xlfn.RANK.EQ(tblAargau[[#This Row],[Fläche in km²]],tblAargau[Fläche in km²])","v":154},187,{"$f":"_xlfn.RANK.EQ(tblAargau[[#This Row],[Einwohner/km²]],tblAargau[Einwohner/km²])","v":160},121,{"$f":"_xlfn.RANK.EQ(tblAargau[[#This Row],[Tax]],tblAargau[Tax],1)","v":200}]
["Riniken","Brugg",1268,1299,1358,1339,1333,1341,1356,1382,1412,1403,1433,1426,1434,1433,1372,1366,1376,1387,1368,1369,1375,1348,1389,1381,1357,1349,1384,1408,1423,1440,1464,{"$f":"_xlfn.RANK.EQ(tblAargau[[#This Row],[2011]],tblAargau[2011])","v":118},0.10646687697160884,-4.4661549197487771E-2,6.4727272727272744E-2,{"$f":"_xlfn.RANK.EQ(tblAargau[[#This Row],[2001-2011]],tblAargau[2001-2011])","v":150},0.15457413249211349,{"$f":"_xlfn.RANK.EQ(tblAargau[[#This Row],[1981-2011]],tblAargau[1981-2011])","v":196},4.75,{"$f":"_xlfn.RANK.EQ(tblAargau[[#This Row],[Fläche in km²]],tblAargau[Fläche in km²])","v":130},308,{"$f":"_xlfn.RANK.EQ(tblAargau[[#This Row],[Einwohner/km²]],tblAargau[Einwohner/km²])","v":115},105,{"$f":"_xlfn.RANK.EQ(tblAargau[[#This Row],[Tax]],tblAargau[Tax],1)","v":92}]
["Rothrist","Zofingen",6090,6127,6203,6256,6333,6411,6515,6548,6579,6627,6756,6824,6875,6991,7017,6962,6909,6868,6851,6800,6930,6990,7018,7129,7189,7269,7391,7524,7630,7762,7979,{"$f":"_xlfn.RANK.EQ(tblAargau[[#This Row],[2011]],tblAargau[2011])","v":16},8.8177339901477803E-2,6.5127294256956958E-3,0.15137085137085138,{"$f":"_xlfn.RANK.EQ(tblAargau[[#This Row],[2001-2011]],tblAargau[2001-2011])","v":76},0.31018062397372748,{"$f":"_xlfn.RANK.EQ(tblAargau[[#This Row],[1981-2011]],tblAargau[1981-2011])","v":152},11.84,{"$f":"_xlfn.RANK.EQ(tblAargau[[#This Row],[Fläche in km²]],tblAargau[Fläche in km²])","v":21},674,{"$f":"_xlfn.RANK.EQ(tblAargau[[#This Row],[Einwohner/km²]],tblAargau[Einwohner/km²])","v":48},105,{"$f":"_xlfn.RANK.EQ(tblAargau[[#This Row],[Tax]],tblAargau[Tax],1)","v":92}]
["Rottenschwil","Muri",300,320,329,368,439,476,497,519,580,618,601,609,645,661,729,763,796,811,799,804,799,806,808,824,812,799,820,842,839,827,803,{"$f":"_xlfn.RANK.EQ(tblAargau[[#This Row],[2011]],tblAargau[2011])","v":174},1.06,0.33777038269550741,5.0062578222778154E-3,{"$f":"_xlfn.RANK.EQ(tblAargau[[#This Row],[2001-2011]],tblAargau[2001-2011])","v":194},1.6766666666666667,{"$f":"_xlfn.RANK.EQ(tblAargau[[#This Row],[1981-2011]],tblAargau[1981-2011])","v":5},4.49,{"$f":"_xlfn.RANK.EQ(tblAargau[[#This Row],[Fläche in km²]],tblAargau[Fläche in km²])","v":136},179,{"$f":"_xlfn.RANK.EQ(tblAargau[[#This Row],[Einwohner/km²]],tblAargau[Einwohner/km²])","v":165},113,{"$f":"_xlfn.RANK.EQ(tblAargau[[#This Row],[Tax]],tblAargau[Tax],1)","v":139}]
["Rudolfstetten-Friedlisberg","Bremgarten",3582,3617,3643,3606,3623,3644,3694,3712,3706,3708,3808,3813,3850,3831,3832,3829,3783,3839,3831,3744,3734,3707,3769,3812,3820,3883,3964,4067,4122,4212,4282,{"$f":"_xlfn.RANK.EQ(tblAargau[[#This Row],[2011]],tblAargau[2011])","v":38},3.5175879396984966E-2,-1.6806722689075682E-2,0.14675950723085163,{"$f":"_xlfn.RANK.EQ(tblAargau[[#This Row],[2001-2011]],tblAargau[2001-2011])","v":80},0.19542155220547186,{"$f":"_xlfn.RANK.EQ(tblAargau[[#This Row],[1981-2011]],tblAargau[1981-2011])","v":188},4.91,{"$f":"_xlfn.RANK.EQ(tblAargau[[#This Row],[Fläche in km²]],tblAargau[Fläche in km²])","v":123},872,{"$f":"_xlfn.RANK.EQ(tblAargau[[#This Row],[Einwohner/km²]],tblAargau[Einwohner/km²])","v":33},91,{"$f":"_xlfn.RANK.EQ(tblAargau[[#This Row],[Tax]],tblAargau[Tax],1)","v":25}]
["Rüfenach","Brugg",523,534,556,562,560,560,574,589,618,618,635,631,651,650,650,661,678,687,684,724,716,734,759,789,801,808,838,859,869,858,884,{"$f":"_xlfn.RANK.EQ(tblAargau[[#This Row],[2011]],tblAargau[2011])","v":166},0.18164435946462709,0.14015748031496056,0.23463687150837997,{"$f":"_xlfn.RANK.EQ(tblAargau[[#This Row],[2001-2011]],tblAargau[2001-2011])","v":24},0.69024856596558326,{"$f":"_xlfn.RANK.EQ(tblAargau[[#This Row],[1981-2011]],tblAargau[1981-2011])","v":51},4.17,{"$f":"_xlfn.RANK.EQ(tblAargau[[#This Row],[Fläche in km²]],tblAargau[Fläche in km²])","v":147},212,{"$f":"_xlfn.RANK.EQ(tblAargau[[#This Row],[Einwohner/km²]],tblAargau[Einwohner/km²])","v":143},108,{"$f":"_xlfn.RANK.EQ(tblAargau[[#This Row],[Tax]],tblAargau[Tax],1)","v":105}]
["Rümikon","Zurzach",166,160,164,159,154,156,174,171,169,196,196,220,222,218,226,225,226,226,223,223,226,221,224,216,210,199,204,220,211,238,239,{"$f":"_xlfn.RANK.EQ(tblAargau[[#This Row],[2011]],tblAargau[2011])","v":214},0.18072289156626509,0.13775510204081631,5.7522123893805288E-2,{"$f":"_xlfn.RANK.EQ(tblAargau[[#This Row],[2001-2011]],tblAargau[2001-2011])","v":155},0.43975903614457823,{"$f":"_xlfn.RANK.EQ(tblAargau[[#This Row],[1981-2011]],tblAargau[1981-2011])","v":100},2.9,{"$f":"_xlfn.RANK.EQ(tblAargau[[#This Row],[Fläche in km²]],tblAargau[Fläche in km²])","v":187},82,{"$f":"_xlfn.RANK.EQ(tblAargau[[#This Row],[Einwohner/km²]],tblAargau[Einwohner/km²])","v":209},115,{"$f":"_xlfn.RANK.EQ(tblAargau[[#This Row],[Tax]],tblAargau[Tax],1)","v":150}]
["Rupperswil","Lenzburg",2755,2770,2787,2779,2855,2933,3050,3148,3187,3225,3308,3306,3397,3434,3470,3597,3586,3711,3715,3678,3739,3702,3822,3891,3971,4060,4124,4273,4292,4382,4599,{"$f":"_xlfn.RANK.EQ(tblAargau[[#This Row],[2011]],tblAargau[2011])","v":35},0.1705989110707804,0.11185006045949208,0.23000802353570471,{"$f":"_xlfn.RANK.EQ(tblAargau[[#This Row],[2001-2011]],tblAargau[2001-2011])","v":26},0.66932849364791291,{"$f":"_xlfn.RANK.EQ(tblAargau[[#This Row],[1981-2011]],tblAargau[1981-2011])","v":56},6.21,{"$f":"_xlfn.RANK.EQ(tblAargau[[#This Row],[Fläche in km²]],tblAargau[Fläche in km²])","v":90},741,{"$f":"_xlfn.RANK.EQ(tblAargau[[#This Row],[Einwohner/km²]],tblAargau[Einwohner/km²])","v":46},95,{"$f":"_xlfn.RANK.EQ(tblAargau[[#This Row],[Tax]],tblAargau[Tax],1)","v":30}]
["Safenwil","Zofingen",2574,2572,2583,2585,2597,2576,2659,2767,2874,2911,2978,3002,3039,3043,3136,3142,3136,3067,3053,3110,3070,3070,3088,3112,3101,3099,3119,3247,3419,3487,3581,{"$f":"_xlfn.RANK.EQ(tblAargau[[#This Row],[2011]],tblAargau[2011])","v":57},0.13092463092463102,4.4325050369375507E-2,0.16644951140065145,{"$f":"_xlfn.RANK.EQ(tblAargau[[#This Row],[2001-2011]],tblAargau[2001-2011])","v":66},0.3912198912198912,{"$f":"_xlfn.RANK.EQ(tblAargau[[#This Row],[1981-2011]],tblAargau[1981-2011])","v":118},5.99,{"$f":"_xlfn.RANK.EQ(tblAargau[[#This Row],[Fläche in km²]],tblAargau[Fläche in km²])","v":94},598,{"$f":"_xlfn.RANK.EQ(tblAargau[[#This Row],[Einwohner/km²]],tblAargau[Einwohner/km²])","v":55},110,{"$f":"_xlfn.RANK.EQ(tblAargau[[#This Row],[Tax]],tblAargau[Tax],1)","v":117}]
["Sarmenstorf","Bremgarten",1490,1474,1504,1481,1491,1480,1491,1534,1572,1657,1773,1816,1789,1860,1924,1947,1998,2016,2070,2115,2151,2174,2217,2225,2279,2269,2280,2336,2368,2467,2515,{"$f":"_xlfn.RANK.EQ(tblAargau[[#This Row],[2011]],tblAargau[2011])","v":82},0.11208053691275177,0.19289340101522834,0.16922361692236176,{"$f":"_xlfn.RANK.EQ(tblAargau[[#This Row],[2001-2011]],tblAargau[2001-2011])","v":62},0.68791946308724827,{"$f":"_xlfn.RANK.EQ(tblAargau[[#This Row],[1981-2011]],tblAargau[1981-2011])","v":52},8.31,{"$f":"_xlfn.RANK.EQ(tblAargau[[#This Row],[Fläche in km²]],tblAargau[Fläche in km²])","v":57},303,{"$f":"_xlfn.RANK.EQ(tblAargau[[#This Row],[Einwohner/km²]],tblAargau[Einwohner/km²])","v":117},105,{"$f":"_xlfn.RANK.EQ(tblAargau[[#This Row],[Tax]],tblAargau[Tax],1)","v":92}]
["Schafisheim","Lenzburg",1679,1675,1722,1741,1786,1827,1816,1886,1917,2002,2090,2161,2207,2251,2317,2457,2477,2559,2588,2638,2626,2643,2690,2679,2678,2665,2679,2670,2724,2781,2860,{"$f":"_xlfn.RANK.EQ(tblAargau[[#This Row],[2011]],tblAargau[2011])","v":73},0.19237641453245979,0.26220095693779899,8.9108910891089188E-2,{"$f":"_xlfn.RANK.EQ(tblAargau[[#This Row],[2001-2011]],tblAargau[2001-2011])","v":132},0.70339487790351396,{"$f":"_xlfn.RANK.EQ(tblAargau[[#This Row],[1981-2011]],tblAargau[1981-2011])","v":48},6.33,{"$f":"_xlfn.RANK.EQ(tblAargau[[#This Row],[Fläche in km²]],tblAargau[Fläche in km²])","v":86},452,{"$f":"_xlfn.RANK.EQ(tblAargau[[#This Row],[Einwohner/km²]],tblAargau[Einwohner/km²])","v":81},98,{"$f":"_xlfn.RANK.EQ(tblAargau[[#This Row],[Tax]],tblAargau[Tax],1)","v":44}]
["Scherz","Brugg",441,448,462,482,500,489,489,480,505,502,520,522,534,523,568,573,593,595,588,561,565,577,567,566,564,562,585,603,614,638,643,{"$f":"_xlfn.RANK.EQ(tblAargau[[#This Row],[2011]],tblAargau[2011])","v":189},0.13832199546485269,7.8846153846153788E-2,0.13805309734513282,{"$f":"_xlfn.RANK.EQ(tblAargau[[#This Row],[2001-2011]],tblAargau[2001-2011])","v":87},0.45804988662131518,{"$f":"_xlfn.RANK.EQ(tblAargau[[#This Row],[1981-2011]],tblAargau[1981-2011])","v":96},3.3,{"$f":"_xlfn.RANK.EQ(tblAargau[[#This Row],[Fläche in km²]],tblAargau[Fläche in km²])","v":174},195,{"$f":"_xlfn.RANK.EQ(tblAargau[[#This Row],[Einwohner/km²]],tblAargau[Einwohner/km²])","v":156},122,{"$f":"_xlfn.RANK.EQ(tblAargau[[#This Row],[Tax]],tblAargau[Tax],1)","v":206}]
["Schinznach-Bad","Brugg",972,964,988,980,974,945,1019,1105,1140,1181,1183,1198,1191,1178,1211,1230,1225,1234,1249,1233,1229,1249,1253,1265,1259,1239,1219,1237,1227,1214,1218,{"$f":"_xlfn.RANK.EQ(tblAargau[[#This Row],[2011]],tblAargau[2011])","v":138},0.21502057613168724,4.2265426880811585E-2,-8.9503661513425925E-3,{"$f":"_xlfn.RANK.EQ(tblAargau[[#This Row],[2001-2011]],tblAargau[2001-2011])","v":200},0.25308641975308643,{"$f":"_xlfn.RANK.EQ(tblAargau[[#This Row],[1981-2011]],tblAargau[1981-2011])","v":171},1.9,{"$f":"_xlfn.RANK.EQ(tblAargau[[#This Row],[Fläche in km²]],tblAargau[Fläche in km²])","v":211},641,{"$f":"_xlfn.RANK.EQ(tblAargau[[#This Row],[Einwohner/km²]],tblAargau[Einwohner/km²])","v":49},110,{"$f":"_xlfn.RANK.EQ(tblAargau[[#This Row],[Tax]],tblAargau[Tax],1)","v":117}]
["Schinznach-Dorf","Brugg",1258,1281,1315,1315,1325,1310,1327,1360,1368,1397,1446,1445,1505,1558,1555,1580,1649,1652,1606,1624,1653,1692,1668,1690,1696,1641,1643,1636,1677,1690,1726,{"$f":"_xlfn.RANK.EQ(tblAargau[[#This Row],[2011]],tblAargau[2011])","v":108},0.11049284578696339,0.12309820193637622,4.4162129461585042E-2,{"$f":"_xlfn.RANK.EQ(tblAargau[[#This Row],[2001-2011]],tblAargau[2001-2011])","v":166},0.37201907790143074,{"$f":"_xlfn.RANK.EQ(tblAargau[[#This Row],[1981-2011]],tblAargau[1981-2011])","v":125},8.85,{"$f":"_xlfn.RANK.EQ(tblAargau[[#This Row],[Fläche in km²]],tblAargau[Fläche in km²])","v":48},195,{"$f":"_xlfn.RANK.EQ(tblAargau[[#This Row],[Einwohner/km²]],tblAargau[Einwohner/km²])","v":156},104,{"$f":"_xlfn.RANK.EQ(tblAargau[[#This Row],[Tax]],tblAargau[Tax],1)","v":87}]
["Schlossrued","Kulm",839,836,839,859,840,875,867,855,876,864,872,909,914,944,957,936,929,926,938,906,893,913,881,876,891,872,863,863,852,829,837,{"$f":"_xlfn.RANK.EQ(tblAargau[[#This Row],[2011]],tblAargau[2011])","v":171},2.9797377830750982E-2,3.8990825688073327E-2,-6.2709966405375184E-2,{"$f":"_xlfn.RANK.EQ(tblAargau[[#This Row],[2001-2011]],tblAargau[2001-2011])","v":215},-2.3837902264600697E-3,{"$f":"_xlfn.RANK.EQ(tblAargau[[#This Row],[1981-2011]],tblAargau[1981-2011])","v":217},7.22,{"$f":"_xlfn.RANK.EQ(tblAargau[[#This Row],[Fläche in km²]],tblAargau[Fläche in km²])","v":68},116,{"$f":"_xlfn.RANK.EQ(tblAargau[[#This Row],[Einwohner/km²]],tblAargau[Einwohner/km²])","v":189},117,{"$f":"_xlfn.RANK.EQ(tblAargau[[#This Row],[Tax]],tblAargau[Tax],1)","v":168}]
["Schmiedrued","Kulm",889,895,917,926,896,899,921,924,951,999,1055,1102,1117,1167,1156,1172,1181,1197,1208,1223,1217,1213,1234,1209,1199,1198,1204,1202,1173,1181,1168,{"$f":"_xlfn.RANK.EQ(tblAargau[[#This Row],[2011]],tblAargau[2011])","v":141},0.12373453318335215,0.15924170616113753,-4.0262941659819251E-2,{"$f":"_xlfn.RANK.EQ(tblAargau[[#This Row],[2001-2011]],tblAargau[2001-2011])","v":210},0.31383577052868383,{"$f":"_xlfn.RANK.EQ(tblAargau[[#This Row],[1981-2011]],tblAargau[1981-2011])","v":150},8.64,{"$f":"_xlfn.RANK.EQ(tblAargau[[#This Row],[Fläche in km²]],tblAargau[Fläche in km²])","v":50},135,{"$f":"_xlfn.RANK.EQ(tblAargau[[#This Row],[Einwohner/km²]],tblAargau[Einwohner/km²])","v":183},110,{"$f":"_xlfn.RANK.EQ(tblAargau[[#This Row],[Tax]],tblAargau[Tax],1)","v":117}]
["Schneisingen","Zurzach",1098,1118,1139,1099,1098,1107,1104,1097,1106,1116,1171,1196,1179,1179,1165,1202,1209,1193,1234,1243,1232,1231,1226,1208,1220,1200,1263,1262,1298,1323,1362,{"$f":"_xlfn.RANK.EQ(tblAargau[[#This Row],[2011]],tblAargau[2011])","v":125},1.6393442622950838E-2,6.1485909479077616E-2,0.10551948051948057,{"$f":"_xlfn.RANK.EQ(tblAargau[[#This Row],[2001-2011]],tblAargau[2001-2011])","v":121},0.2404371584699454,{"$f":"_xlfn.RANK.EQ(tblAargau[[#This Row],[1981-2011]],tblAargau[1981-2011])","v":175},8.25,{"$f":"_xlfn.RANK.EQ(tblAargau[[#This Row],[Fläche in km²]],tblAargau[Fläche in km²])","v":59},165,{"$f":"_xlfn.RANK.EQ(tblAargau[[#This Row],[Einwohner/km²]],tblAargau[Einwohner/km²])","v":172},112,{"$f":"_xlfn.RANK.EQ(tblAargau[[#This Row],[Tax]],tblAargau[Tax],1)","v":130}]
["Schöftland","Kulm",2734,2737,2685,2676,2646,2616,2572,2546,2549,2605,2726,2718,2798,2867,2976,2990,3160,3180,3215,3220,3291,3276,3262,3283,3322,3423,3520,3607,3701,3708,3801,{"$f":"_xlfn.RANK.EQ(tblAargau[[#This Row],[2011]],tblAargau[2011])","v":50},-4.718361375274327E-2,0.18121790168745422,0.15496809480401086,{"$f":"_xlfn.RANK.EQ(tblAargau[[#This Row],[2001-2011]],tblAargau[2001-2011])","v":70},0.39027066569129487,{"$f":"_xlfn.RANK.EQ(tblAargau[[#This Row],[1981-2011]],tblAargau[1981-2011])","v":119},6.28,{"$f":"_xlfn.RANK.EQ(tblAargau[[#This Row],[Fläche in km²]],tblAargau[Fläche in km²])","v":88},605,{"$f":"_xlfn.RANK.EQ(tblAargau[[#This Row],[Einwohner/km²]],tblAargau[Einwohner/km²])","v":54},102,{"$f":"_xlfn.RANK.EQ(tblAargau[[#This Row],[Tax]],tblAargau[Tax],1)","v":75}]
["Schupfart","Rheinfelden",491,494,489,488,494,503,510,519,502,525,567,579,608,582,629,648,658,677,687,684,668,679,720,722,749,744,748,759,764,767,771,{"$f":"_xlfn.RANK.EQ(tblAargau[[#This Row],[2011]],tblAargau[2011])","v":177},6.9246435845213838E-2,0.20634920634920628,0.15419161676646698,{"$f":"_xlfn.RANK.EQ(tblAargau[[#This Row],[2001-2011]],tblAargau[2001-2011])","v":73},0.570264765784114,{"$f":"_xlfn.RANK.EQ(tblAargau[[#This Row],[1981-2011]],tblAargau[1981-2011])","v":71},7.04,{"$f":"_xlfn.RANK.EQ(tblAargau[[#This Row],[Fläche in km²]],tblAargau[Fläche in km²])","v":75},110,{"$f":"_xlfn.RANK.EQ(tblAargau[[#This Row],[Einwohner/km²]],tblAargau[Einwohner/km²])","v":194},115,{"$f":"_xlfn.RANK.EQ(tblAargau[[#This Row],[Tax]],tblAargau[Tax],1)","v":150}]
["Schwaderloch","Laufenburg",449,445,441,439,469,454,465,466,472,497,547,551,599,625,648,663,658,649,654,668,669,650,656,679,682,688,681,666,655,673,676,{"$f":"_xlfn.RANK.EQ(tblAargau[[#This Row],[2011]],tblAargau[2011])","v":186},0.10690423162583529,0.22120658135283366,1.0463378176382765E-2,{"$f":"_xlfn.RANK.EQ(tblAargau[[#This Row],[2001-2011]],tblAargau[2001-2011])","v":190},0.50556792873051215,{"$f":"_xlfn.RANK.EQ(tblAargau[[#This Row],[1981-2011]],tblAargau[1981-2011])","v":85},2.78,{"$f":"_xlfn.RANK.EQ(tblAargau[[#This Row],[Fläche in km²]],tblAargau[Fläche in km²])","v":193},243,{"$f":"_xlfn.RANK.EQ(tblAargau[[#This Row],[Einwohner/km²]],tblAargau[Einwohner/km²])","v":130},126,{"$f":"_xlfn.RANK.EQ(tblAargau[[#This Row],[Tax]],tblAargau[Tax],1)","v":219}]
["Seengen","Lenzburg",1624,1655,1672,1705,1743,1789,1866,1939,1989,2026,2105,2122,2172,2209,2290,2352,2431,2476,2534,2627,2659,2736,2859,2927,2998,3046,3194,3268,3362,3396,3556,{"$f":"_xlfn.RANK.EQ(tblAargau[[#This Row],[2011]],tblAargau[2011])","v":59},0.24753694581280783,0.24798099762470316,0.33734486649116202,{"$f":"_xlfn.RANK.EQ(tblAargau[[#This Row],[2001-2011]],tblAargau[2001-2011])","v":12},1.1896551724137931,{"$f":"_xlfn.RANK.EQ(tblAargau[[#This Row],[1981-2011]],tblAargau[1981-2011])","v":17},9.69,{"$f":"_xlfn.RANK.EQ(tblAargau[[#This Row],[Fläche in km²]],tblAargau[Fläche in km²])","v":38},367,{"$f":"_xlfn.RANK.EQ(tblAargau[[#This Row],[Einwohner/km²]],tblAargau[Einwohner/km²])","v":98},84,{"$f":"_xlfn.RANK.EQ(tblAargau[[#This Row],[Tax]],tblAargau[Tax],1)","v":9}]
["Seon","Lenzburg",3894,3904,3983,4027,4083,4127,4294,4369,4390,4424,4449,4453,4539,4530,4471,4546,4600,4588,4626,4651,4672,4647,4581,4563,4559,4564,4593,4660,4699,4715,4773,{"$f":"_xlfn.RANK.EQ(tblAargau[[#This Row],[2011]],tblAargau[2011])","v":32},0.13610683102208521,4.5403461452011795E-2,2.1618150684931559E-2,{"$f":"_xlfn.RANK.EQ(tblAargau[[#This Row],[2001-2011]],tblAargau[2001-2011])","v":182},0.22573189522342063,{"$f":"_xlfn.RANK.EQ(tblAargau[[#This Row],[1981-2011]],tblAargau[1981-2011])","v":180},9.6199999999999992,{"$f":"_xlfn.RANK.EQ(tblAargau[[#This Row],[Fläche in km²]],tblAargau[Fläche in km²])","v":39},496,{"$f":"_xlfn.RANK.EQ(tblAargau[[#This Row],[Einwohner/km²]],tblAargau[Einwohner/km²])","v":73},108,{"$f":"_xlfn.RANK.EQ(tblAargau[[#This Row],[Tax]],tblAargau[Tax],1)","v":105}]
["Siglistorf","Zurzach",372,372,374,421,443,451,471,464,494,511,552,558,562,547,563,601,582,546,538,528,548,568,572,565,557,586,591,627,610,632,617,{"$f":"_xlfn.RANK.EQ(tblAargau[[#This Row],[2011]],tblAargau[2011])","v":191},0.37365591397849451,-4.3478260869565188E-2,0.12591240875912413,{"$f":"_xlfn.RANK.EQ(tblAargau[[#This Row],[2001-2011]],tblAargau[2001-2011])","v":99},0.65860215053763449,{"$f":"_xlfn.RANK.EQ(tblAargau[[#This Row],[1981-2011]],tblAargau[1981-2011])","v":58},5.51,{"$f":"_xlfn.RANK.EQ(tblAargau[[#This Row],[Fläche in km²]],tblAargau[Fläche in km²])","v":107},112,{"$f":"_xlfn.RANK.EQ(tblAargau[[#This Row],[Einwohner/km²]],tblAargau[Einwohner/km²])","v":193},121,{"$f":"_xlfn.RANK.EQ(tblAargau[[#This Row],[Tax]],tblAargau[Tax],1)","v":200}]
["Sins","Muri",2649,2649,2670,2689,2715,2731,2729,2732,2792,2828,3014,2978,3045,3034,3110,3138,3225,3230,3265,3287,3249,3304,3370,3432,3469,3583,3648,3728,3849,4038,4127,{"$f":"_xlfn.RANK.EQ(tblAargau[[#This Row],[2011]],tblAargau[2011])","v":47},6.7572668931672242E-2,9.0577305905773065E-2,0.27023699599876894,{"$f":"_xlfn.RANK.EQ(tblAargau[[#This Row],[2001-2011]],tblAargau[2001-2011])","v":19},0.55794639486598707,{"$f":"_xlfn.RANK.EQ(tblAargau[[#This Row],[1981-2011]],tblAargau[1981-2011])","v":76},20.3,{"$f":"_xlfn.RANK.EQ(tblAargau[[#This Row],[Fläche in km²]],tblAargau[Fläche in km²])","v":2},203,{"$f":"_xlfn.RANK.EQ(tblAargau[[#This Row],[Einwohner/km²]],tblAargau[Einwohner/km²])","v":150},105,{"$f":"_xlfn.RANK.EQ(tblAargau[[#This Row],[Tax]],tblAargau[Tax],1)","v":92}]
["Sisseln","Laufenburg",732,716,753,751,759,917,979,1034,1092,1153,1173,1200,1203,1214,1214,1218,1234,1238,1271,1277,1274,1307,1314,1335,1332,1320,1362,1307,1304,1415,1462,{"$f":"_xlfn.RANK.EQ(tblAargau[[#This Row],[2011]],tblAargau[2011])","v":119},0.57513661202185795,8.8661551577152498E-2,0.1475667189952905,{"$f":"_xlfn.RANK.EQ(tblAargau[[#This Row],[2001-2011]],tblAargau[2001-2011])","v":79},0.99726775956284164,{"$f":"_xlfn.RANK.EQ(tblAargau[[#This Row],[1981-2011]],tblAargau[1981-2011])","v":24},2.52,{"$f":"_xlfn.RANK.EQ(tblAargau[[#This Row],[Fläche in km²]],tblAargau[Fläche in km²])","v":199},580,{"$f":"_xlfn.RANK.EQ(tblAargau[[#This Row],[Einwohner/km²]],tblAargau[Einwohner/km²])","v":60},80,{"$f":"_xlfn.RANK.EQ(tblAargau[[#This Row],[Tax]],tblAargau[Tax],1)","v":5}]
["Spreitenbach","Baden",7321,7307,7298,7386,7623,7938,8149,8133,8277,8417,8457,8577,8595,8621,8797,8773,8594,8699,8827,9045,9502,9764,9850,9935,9982,10084,10184,10465,10656,10831,10955,{"$f":"_xlfn.RANK.EQ(tblAargau[[#This Row],[2011]],tblAargau[2011])","v":8},0.14970632427264041,6.952820148989014E-2,0.15291517575247315,{"$f":"_xlfn.RANK.EQ(tblAargau[[#This Row],[2001-2011]],tblAargau[2001-2011])","v":74},0.49638027591859046,{"$f":"_xlfn.RANK.EQ(tblAargau[[#This Row],[1981-2011]],tblAargau[1981-2011])","v":86},8.6,{"$f":"_xlfn.RANK.EQ(tblAargau[[#This Row],[Fläche in km²]],tblAargau[Fläche in km²])","v":52},1274,{"$f":"_xlfn.RANK.EQ(tblAargau[[#This Row],[Einwohner/km²]],tblAargau[Einwohner/km²])","v":14},101,{"$f":"_xlfn.RANK.EQ(tblAargau[[#This Row],[Tax]],tblAargau[Tax],1)","v":74}]
["Staffelbach","Zofingen",724,710,727,738,770,773,789,820,817,851,899,928,944,916,944,939,956,972,992,1007,1014,1031,1027,1036,1039,1019,1029,1034,1038,1036,1034,{"$f":"_xlfn.RANK.EQ(tblAargau[[#This Row],[2011]],tblAargau[2011])","v":149},0.17541436464088389,0.12013348164627358,1.9723865877712132E-2,{"$f":"_xlfn.RANK.EQ(tblAargau[[#This Row],[2001-2011]],tblAargau[2001-2011])","v":183},0.42817679558011057,{"$f":"_xlfn.RANK.EQ(tblAargau[[#This Row],[1981-2011]],tblAargau[1981-2011])","v":102},8.94,{"$f":"_xlfn.RANK.EQ(tblAargau[[#This Row],[Fläche in km²]],tblAargau[Fläche in km²])","v":45},116,{"$f":"_xlfn.RANK.EQ(tblAargau[[#This Row],[Einwohner/km²]],tblAargau[Einwohner/km²])","v":189},119,{"$f":"_xlfn.RANK.EQ(tblAargau[[#This Row],[Tax]],tblAargau[Tax],1)","v":189}]
["Staufen","Lenzburg",2097,2144,2171,2192,2189,2159,2157,2130,2162,2152,2202,2198,2230,2199,2177,2186,2166,2188,2182,2178,2256,2262,2303,2323,2311,2330,2441,2580,2596,2575,2605,{"$f":"_xlfn.RANK.EQ(tblAargau[[#This Row],[2011]],tblAargau[2011])","v":77},2.6227944682880366E-2,-1.0899182561307952E-2,0.15469858156028371,{"$f":"_xlfn.RANK.EQ(tblAargau[[#This Row],[2001-2011]],tblAargau[2001-2011])","v":71},0.24225083452551255,{"$f":"_xlfn.RANK.EQ(tblAargau[[#This Row],[1981-2011]],tblAargau[1981-2011])","v":174},3.57,{"$f":"_xlfn.RANK.EQ(tblAargau[[#This Row],[Fläche in km²]],tblAargau[Fläche in km²])","v":163},730,{"$f":"_xlfn.RANK.EQ(tblAargau[[#This Row],[Einwohner/km²]],tblAargau[Einwohner/km²])","v":47},80,{"$f":"_xlfn.RANK.EQ(tblAargau[[#This Row],[Tax]],tblAargau[Tax],1)","v":5}]
["Stein (AG)","Rheinfelden",1833,1806,1799,1821,1844,1840,1864,1868,1886,1904,1921,1981,2004,2027,2068,2125,2293,2277,2309,2355,2424,2455,2462,2459,2470,2624,2721,2800,2789,2797,2900,{"$f":"_xlfn.RANK.EQ(tblAargau[[#This Row],[2011]],tblAargau[2011])","v":70},3.873431533006011E-2,0.2259239979177512,0.19636963696369647,{"$f":"_xlfn.RANK.EQ(tblAargau[[#This Row],[2001-2011]],tblAargau[2001-2011])","v":39},0.58210583742498634,{"$f":"_xlfn.RANK.EQ(tblAargau[[#This Row],[1981-2011]],tblAargau[1981-2011])","v":68},2.81,{"$f":"_xlfn.RANK.EQ(tblAargau[[#This Row],[Fläche in km²]],tblAargau[Fläche in km²])","v":192},1032,{"$f":"_xlfn.RANK.EQ(tblAargau[[#This Row],[Einwohner/km²]],tblAargau[Einwohner/km²])","v":22},98,{"$f":"_xlfn.RANK.EQ(tblAargau[[#This Row],[Tax]],tblAargau[Tax],1)","v":44}]
["Stetten (AG)","Baden",980,989,995,1029,1201,1282,1301,1330,1326,1358,1487,1499,1554,1597,1594,1574,1535,1553,1541,1574,1569,1554,1534,1511,1521,1497,1526,1540,1565,1625,1680,{"$f":"_xlfn.RANK.EQ(tblAargau[[#This Row],[2011]],tblAargau[2011])","v":109},0.38571428571428568,5.8507061197041077E-2,7.074569789674956E-2,{"$f":"_xlfn.RANK.EQ(tblAargau[[#This Row],[2001-2011]],tblAargau[2001-2011])","v":146},0.71428571428571419,{"$f":"_xlfn.RANK.EQ(tblAargau[[#This Row],[1981-2011]],tblAargau[1981-2011])","v":46},4.41,{"$f":"_xlfn.RANK.EQ(tblAargau[[#This Row],[Fläche in km²]],tblAargau[Fläche in km²])","v":139},381,{"$f":"_xlfn.RANK.EQ(tblAargau[[#This Row],[Einwohner/km²]],tblAargau[Einwohner/km²])","v":96},100,{"$f":"_xlfn.RANK.EQ(tblAargau[[#This Row],[Tax]],tblAargau[Tax],1)","v":60}]
["Strengelbach","Zofingen",3846,3871,3897,3907,3925,3966,4007,3999,4012,3989,4012,4011,3976,3955,4022,4059,4031,3996,4089,4142,4063,4135,4153,4171,4246,4320,4337,4471,4515,4523,4576,{"$f":"_xlfn.RANK.EQ(tblAargau[[#This Row],[2011]],tblAargau[2011])","v":36},3.7181487259490442E-2,3.2402791625124605E-2,0.12626138321437352,{"$f":"_xlfn.RANK.EQ(tblAargau[[#This Row],[2001-2011]],tblAargau[2001-2011])","v":98},0.18980759230369215,{"$f":"_xlfn.RANK.EQ(tblAargau[[#This Row],[1981-2011]],tblAargau[1981-2011])","v":190},6.01,{"$f":"_xlfn.RANK.EQ(tblAargau[[#This Row],[Fläche in km²]],tblAargau[Fläche in km²])","v":93},761,{"$f":"_xlfn.RANK.EQ(tblAargau[[#This Row],[Einwohner/km²]],tblAargau[Einwohner/km²])","v":42},114,{"$f":"_xlfn.RANK.EQ(tblAargau[[#This Row],[Tax]],tblAargau[Tax],1)","v":144}]
["Suhr","Aarau",7371,7237,7116,7041,7004,7137,7444,7568,7794,7876,7720,7767,7787,7658,7692,7731,7811,7929,8052,8228,8537,8787,8868,8939,9080,9199,9312,9458,9512,9640,9750,{"$f":"_xlfn.RANK.EQ(tblAargau[[#This Row],[2011]],tblAargau[2011])","v":11},6.8511735178401922E-2,6.5803108808290212E-2,0.14208738432704693,{"$f":"_xlfn.RANK.EQ(tblAargau[[#This Row],[2001-2011]],tblAargau[2001-2011])","v":84},0.32275132275132279,{"$f":"_xlfn.RANK.EQ(tblAargau[[#This Row],[1981-2011]],tblAargau[1981-2011])","v":147},10.61,{"$f":"_xlfn.RANK.EQ(tblAargau[[#This Row],[Fläche in km²]],tblAargau[Fläche in km²])","v":30},919,{"$f":"_xlfn.RANK.EQ(tblAargau[[#This Row],[Einwohner/km²]],tblAargau[Einwohner/km²])","v":29},108,{"$f":"_xlfn.RANK.EQ(tblAargau[[#This Row],[Tax]],tblAargau[Tax],1)","v":105}]
["Tägerig","Bremgarten",867,872,881,899,953,959,942,992,1006,1016,1059,1083,1101,1134,1169,1129,1134,1141,1172,1206,1175,1203,1210,1245,1274,1311,1336,1364,1361,1357,1359,{"$f":"_xlfn.RANK.EQ(tblAargau[[#This Row],[2011]],tblAargau[2011])","v":126},0.17185697808535183,0.13881019830028318,0.15659574468085102,{"$f":"_xlfn.RANK.EQ(tblAargau[[#This Row],[2001-2011]],tblAargau[2001-2011])","v":68},0.56747404844290661,{"$f":"_xlfn.RANK.EQ(tblAargau[[#This Row],[1981-2011]],tblAargau[1981-2011])","v":73},3.29,{"$f":"_xlfn.RANK.EQ(tblAargau[[#This Row],[Fläche in km²]],tblAargau[Fläche in km²])","v":177},413,{"$f":"_xlfn.RANK.EQ(tblAargau[[#This Row],[Einwohner/km²]],tblAargau[Einwohner/km²])","v":87},113,{"$f":"_xlfn.RANK.EQ(tblAargau[[#This Row],[Tax]],tblAargau[Tax],1)","v":139}]
["Tegerfelden","Zurzach",650,651,645,649,698,728,735,761,793,795,822,866,883,903,923,917,940,953,991,968,970,969,963,998,1018,997,995,1022,1043,1051,1078,{"$f":"_xlfn.RANK.EQ(tblAargau[[#This Row],[2011]],tblAargau[2011])","v":144},0.22307692307692317,0.17761557177615561,0.11134020618556706,{"$f":"_xlfn.RANK.EQ(tblAargau[[#This Row],[2001-2011]],tblAargau[2001-2011])","v":115},0.65846153846153843,{"$f":"_xlfn.RANK.EQ(tblAargau[[#This Row],[1981-2011]],tblAargau[1981-2011])","v":59},7.11,{"$f":"_xlfn.RANK.EQ(tblAargau[[#This Row],[Fläche in km²]],tblAargau[Fläche in km²])","v":71},152,{"$f":"_xlfn.RANK.EQ(tblAargau[[#This Row],[Einwohner/km²]],tblAargau[Einwohner/km²])","v":176},112,{"$f":"_xlfn.RANK.EQ(tblAargau[[#This Row],[Tax]],tblAargau[Tax],1)","v":130}]
["Teufenthal (AG)","Kulm",1554,1579,1562,1542,1525,1563,1578,1552,1546,1578,1651,1667,1696,1676,1658,1662,1624,1633,1620,1604,1580,1597,1587,1605,1590,1569,1570,1604,1570,1571,1619,{"$f":"_xlfn.RANK.EQ(tblAargau[[#This Row],[2011]],tblAargau[2011])","v":110},1.5444015444015413E-2,-2.8467595396729273E-2,2.4683544303797378E-2,{"$f":"_xlfn.RANK.EQ(tblAargau[[#This Row],[2001-2011]],tblAargau[2001-2011])","v":180},4.1827541827541781E-2,{"$f":"_xlfn.RANK.EQ(tblAargau[[#This Row],[1981-2011]],tblAargau[1981-2011])","v":212},3.57,{"$f":"_xlfn.RANK.EQ(tblAargau[[#This Row],[Fläche in km²]],tblAargau[Fläche in km²])","v":163},454,{"$f":"_xlfn.RANK.EQ(tblAargau[[#This Row],[Einwohner/km²]],tblAargau[Einwohner/km²])","v":79},118,{"$f":"_xlfn.RANK.EQ(tblAargau[[#This Row],[Tax]],tblAargau[Tax],1)","v":178}]
["Thalheim (AG)","Brugg",556,568,555,557,580,589,586,598,598,628,679,726,765,756,759,769,789,790,777,758,752,760,777,776,765,756,739,735,744,735,730,{"$f":"_xlfn.RANK.EQ(tblAargau[[#This Row],[2011]],tblAargau[2011])","v":183},0.12949640287769792,0.11634756995581741,-2.9255319148936199E-2,{"$f":"_xlfn.RANK.EQ(tblAargau[[#This Row],[2001-2011]],tblAargau[2001-2011])","v":209},0.31294964028776984,{"$f":"_xlfn.RANK.EQ(tblAargau[[#This Row],[1981-2011]],tblAargau[1981-2011])","v":151},9.91,{"$f":"_xlfn.RANK.EQ(tblAargau[[#This Row],[Fläche in km²]],tblAargau[Fläche in km²])","v":35},74,{"$f":"_xlfn.RANK.EQ(tblAargau[[#This Row],[Einwohner/km²]],tblAargau[Einwohner/km²])","v":211},112,{"$f":"_xlfn.RANK.EQ(tblAargau[[#This Row],[Tax]],tblAargau[Tax],1)","v":130}]
["Turgi","Baden",2662,2661,2625,2726,2647,2641,2599,2601,2565,2572,2589,2559,2548,2540,2476,2445,2352,2275,2347,2361,2490,2590,2629,2657,2653,2713,2751,2823,2805,2824,2941,{"$f":"_xlfn.RANK.EQ(tblAargau[[#This Row],[2011]],tblAargau[2011])","v":69},-3.3809166040571048E-2,-8.8064889918887612E-2,0.18112449799196795,{"$f":"_xlfn.RANK.EQ(tblAargau[[#This Row],[2001-2011]],tblAargau[2001-2011])","v":57},0.10480841472577018,{"$f":"_xlfn.RANK.EQ(tblAargau[[#This Row],[1981-2011]],tblAargau[1981-2011])","v":209},1.55,{"$f":"_xlfn.RANK.EQ(tblAargau[[#This Row],[Fläche in km²]],tblAargau[Fläche in km²])","v":214},1897,{"$f":"_xlfn.RANK.EQ(tblAargau[[#This Row],[Einwohner/km²]],tblAargau[Einwohner/km²])","v":2},113,{"$f":"_xlfn.RANK.EQ(tblAargau[[#This Row],[Tax]],tblAargau[Tax],1)","v":139}]
["Ueken","Laufenburg",367,364,362,369,378,373,395,410,445,452,501,509,556,597,598,634,636,621,648,689,713,728,741,753,804,817,833,851,864,855,862,{"$f":"_xlfn.RANK.EQ(tblAargau[[#This Row],[2011]],tblAargau[2011])","v":167},0.23160762942779289,0.37524950099800392,0.20897615708274886,{"$f":"_xlfn.RANK.EQ(tblAargau[[#This Row],[2001-2011]],tblAargau[2001-2011])","v":34},1.3487738419618527,{"$f":"_xlfn.RANK.EQ(tblAargau[[#This Row],[1981-2011]],tblAargau[1981-2011])","v":10},5.0999999999999996,{"$f":"_xlfn.RANK.EQ(tblAargau[[#This Row],[Fläche in km²]],tblAargau[Fläche in km²])","v":117},169,{"$f":"_xlfn.RANK.EQ(tblAargau[[#This Row],[Einwohner/km²]],tblAargau[Einwohner/km²])","v":170},125,{"$f":"_xlfn.RANK.EQ(tblAargau[[#This Row],[Tax]],tblAargau[Tax],1)","v":215}]
["Uerkheim","Zofingen",1166,1170,1196,1221,1214,1201,1208,1221,1229,1252,1293,1309,1301,1277,1303,1323,1323,1302,1298,1270,1274,1283,1269,1271,1291,1286,1285,1265,1274,1259,1303,{"$f":"_xlfn.RANK.EQ(tblAargau[[#This Row],[2011]],tblAargau[2011])","v":131},7.3756432246998349E-2,-1.7788089713843824E-2,2.2762951334379888E-2,{"$f":"_xlfn.RANK.EQ(tblAargau[[#This Row],[2001-2011]],tblAargau[2001-2011])","v":181},0.11749571183533458,{"$f":"_xlfn.RANK.EQ(tblAargau[[#This Row],[1981-2011]],tblAargau[1981-2011])","v":205},7.1,{"$f":"_xlfn.RANK.EQ(tblAargau[[#This Row],[Fläche in km²]],tblAargau[Fläche in km²])","v":72},184,{"$f":"_xlfn.RANK.EQ(tblAargau[[#This Row],[Einwohner/km²]],tblAargau[Einwohner/km²])","v":162},123,{"$f":"_xlfn.RANK.EQ(tblAargau[[#This Row],[Tax]],tblAargau[Tax],1)","v":211}]
["Uezwil","Bremgarten",280,292,308,308,305,312,305,299,313,314,333,329,340,340,337,338,332,336,350,364,358,374,381,372,364,360,378,412,407,418,425,{"$f":"_xlfn.RANK.EQ(tblAargau[[#This Row],[2011]],tblAargau[2011])","v":200},0.12142857142857144,9.3093093093093104E-2,0.18715083798882692,{"$f":"_xlfn.RANK.EQ(tblAargau[[#This Row],[2001-2011]],tblAargau[2001-2011])","v":47},0.51785714285714279,{"$f":"_xlfn.RANK.EQ(tblAargau[[#This Row],[1981-2011]],tblAargau[1981-2011])","v":83},2.44,{"$f":"_xlfn.RANK.EQ(tblAargau[[#This Row],[Fläche in km²]],tblAargau[Fläche in km²])","v":202},174,{"$f":"_xlfn.RANK.EQ(tblAargau[[#This Row],[Einwohner/km²]],tblAargau[Einwohner/km²])","v":168},109,{"$f":"_xlfn.RANK.EQ(tblAargau[[#This Row],[Tax]],tblAargau[Tax],1)","v":112}]
["Unterbözberg","Brugg",586,591,606,611,624,637,635,640,655,677,659,640,652,681,738,741,740,739,750,749,734,710,707,708,694,688,707,713,736,727,735,{"$f":"_xlfn.RANK.EQ(tblAargau[[#This Row],[2011]],tblAargau[2011])","v":181},0.15529010238907848,0.13657056145675273,1.3623978201635634E-3,{"$f":"_xlfn.RANK.EQ(tblAargau[[#This Row],[2001-2011]],tblAargau[2001-2011])","v":197},0.25426621160409546,{"$f":"_xlfn.RANK.EQ(tblAargau[[#This Row],[1981-2011]],tblAargau[1981-2011])","v":170},6.12,{"$f":"_xlfn.RANK.EQ(tblAargau[[#This Row],[Fläche in km²]],tblAargau[Fläche in km²])","v":92},120,{"$f":"_xlfn.RANK.EQ(tblAargau[[#This Row],[Einwohner/km²]],tblAargau[Einwohner/km²])","v":187},99,{"$f":"_xlfn.RANK.EQ(tblAargau[[#This Row],[Tax]],tblAargau[Tax],1)","v":53}]
["Unterendingen","Zurzach",188,198,220,243,260,271,290,296,322,314,349,335,351,359,375,377,373,370,380,376,371,372,370,379,357,358,353,368,362,370,364,{"$f":"_xlfn.RANK.EQ(tblAargau[[#This Row],[2011]],tblAargau[2011])","v":206},0.67021276595744683,7.7363896848137603E-2,-1.8867924528301883E-2,{"$f":"_xlfn.RANK.EQ(tblAargau[[#This Row],[2001-2011]],tblAargau[2001-2011])","v":202},0.93617021276595747,{"$f":"_xlfn.RANK.EQ(tblAargau[[#This Row],[1981-2011]],tblAargau[1981-2011])","v":29},3.46,{"$f":"_xlfn.RANK.EQ(tblAargau[[#This Row],[Fläche in km²]],tblAargau[Fläche in km²])","v":168},105,{"$f":"_xlfn.RANK.EQ(tblAargau[[#This Row],[Einwohner/km²]],tblAargau[Einwohner/km²])","v":196},108,{"$f":"_xlfn.RANK.EQ(tblAargau[[#This Row],[Tax]],tblAargau[Tax],1)","v":105}]
["Unterentfelden","Aarau",3263,3312,3359,3428,3451,3433,3416,3427,3397,3400,3357,3339,3335,3280,3239,3181,3231,3178,3212,3184,3197,3251,3299,3440,3585,3734,3760,3768,3899,3863,3918,{"$f":"_xlfn.RANK.EQ(tblAargau[[#This Row],[2011]],tblAargau[2011])","v":48},4.1985902543671516E-2,-5.1534107834375953E-2,0.22552392868314053,{"$f":"_xlfn.RANK.EQ(tblAargau[[#This Row],[2001-2011]],tblAargau[2001-2011])","v":28},0.20073551946061907,{"$f":"_xlfn.RANK.EQ(tblAargau[[#This Row],[1981-2011]],tblAargau[1981-2011])","v":186},2.88,{"$f":"_xlfn.RANK.EQ(tblAargau[[#This Row],[Fläche in km²]],tblAargau[Fläche in km²])","v":188},1360,{"$f":"_xlfn.RANK.EQ(tblAargau[[#This Row],[Einwohner/km²]],tblAargau[Einwohner/km²])","v":10},103,{"$f":"_xlfn.RANK.EQ(tblAargau[[#This Row],[Tax]],tblAargau[Tax],1)","v":81}]
["Unterkulm","Kulm",2541,2488,2438,2476,2474,2518,2560,2522,2547,2543,2657,2647,2737,2793,2768,2750,2753,2740,2705,2719,2674,2762,2840,2856,2891,2882,2894,2895,2882,2890,2864,{"$f":"_xlfn.RANK.EQ(tblAargau[[#This Row],[2011]],tblAargau[2011])","v":72},7.8709169618251806E-4,2.3334587881068902E-2,7.1054599850411293E-2,{"$f":"_xlfn.RANK.EQ(tblAargau[[#This Row],[2001-2011]],tblAargau[2001-2011])","v":145},0.12711530893349066,{"$f":"_xlfn.RANK.EQ(tblAargau[[#This Row],[1981-2011]],tblAargau[1981-2011])","v":203},8.89,{"$f":"_xlfn.RANK.EQ(tblAargau[[#This Row],[Fläche in km²]],tblAargau[Fläche in km²])","v":46},322,{"$f":"_xlfn.RANK.EQ(tblAargau[[#This Row],[Einwohner/km²]],tblAargau[Einwohner/km²])","v":111},118,{"$f":"_xlfn.RANK.EQ(tblAargau[[#This Row],[Tax]],tblAargau[Tax],1)","v":178}]
["Unterlunkhofen","Bremgarten",415,461,490,521,571,617,649,671,700,727,773,842,876,887,933,982,1007,1086,1128,1229,1238,1247,1267,1247,1240,1230,1239,1251,1256,1280,1288,{"$f":"_xlfn.RANK.EQ(tblAargau[[#This Row],[2011]],tblAargau[2011])","v":132},{"$f":"IFERROR(L194/C194-1,0)","v":0.75180722891566254},{"$f":"IFERROR(V194/M194-1,0)","v":0.58990944372574394},{"$f":"IFERROR(AG194/W194-1,0)","v":4.0387722132471771E-2},{"$f":"_xlfn.RANK.EQ(tblAargau[[#This Row],[2001-2011]],tblAargau[2001-2011])","v":170},{"$f":"IFERROR(AG194/C194-1,0)","v":2.1036144578313252},{"$f":"_xlfn.RANK.EQ(tblAargau[[#This Row],[1981-2011]],tblAargau[1981-2011])","v":2},4.49,{"$f":"_xlfn.RANK.EQ(tblAargau[[#This Row],[Fläche in km²]],tblAargau[Fläche in km²])","v":136},287,{"$f":"_xlfn.RANK.EQ(tblAargau[[#This Row],[Einwohner/km²]],tblAargau[Einwohner/km²])","v":120},83,{"$f":"_xlfn.RANK.EQ(tblAargau[[#This Row],[Tax]],tblAargau[Tax],1)","v":7}]
["Untersiggenthal","Baden",4736,4735,4709,4773,4826,4834,5058,5101,5110,5215,5456,5629,5500,5612,5680,5676,5713,5902,5886,6007,6053,6179,6211,6166,6190,6231,6335,6360,6484,6674,6827,{"$f":"_xlfn.RANK.EQ(tblAargau[[#This Row],[2011]],tblAargau[2011])","v":22},0.10114020270270263,0.10098973607038131,0.12787047744919877,{"$f":"_xlfn.RANK.EQ(tblAargau[[#This Row],[2001-2011]],tblAargau[2001-2011])","v":96},0.44151182432432434,{"$f":"_xlfn.RANK.EQ(tblAargau[[#This Row],[1981-2011]],tblAargau[1981-2011])","v":99},8.27,{"$f":"_xlfn.RANK.EQ(tblAargau[[#This Row],[Fläche in km²]],tblAargau[Fläche in km²])","v":58},826,{"$f":"_xlfn.RANK.EQ(tblAargau[[#This Row],[Einwohner/km²]],tblAargau[Einwohner/km²])","v":39},100,{"$f":"_xlfn.RANK.EQ(tblAargau[[#This Row],[Tax]],tblAargau[Tax],1)","v":60}]
["Veltheim (AG)","Brugg",1037,1058,1069,1065,1065,1047,1053,1093,1112,1195,1236,1245,1258,1236,1294,1348,1369,1357,1399,1377,1374,1391,1364,1378,1359,1359,1402,1379,1379,1381,1416,{"$f":"_xlfn.RANK.EQ(tblAargau[[#This Row],[2011]],tblAargau[2011])","v":122},0.15236258437801342,0.11407766990291268,3.0567685589519611E-2,{"$f":"_xlfn.RANK.EQ(tblAargau[[#This Row],[2001-2011]],tblAargau[2001-2011])","v":175},0.36547733847637409,{"$f":"_xlfn.RANK.EQ(tblAargau[[#This Row],[1981-2011]],tblAargau[1981-2011])","v":130},5.24,{"$f":"_xlfn.RANK.EQ(tblAargau[[#This Row],[Fläche in km²]],tblAargau[Fläche in km²])","v":115},270,{"$f":"_xlfn.RANK.EQ(tblAargau[[#This Row],[Einwohner/km²]],tblAargau[Einwohner/km²])","v":124},115,{"$f":"_xlfn.RANK.EQ(tblAargau[[#This Row],[Tax]],tblAargau[Tax],1)","v":150}]
["Villigen","Brugg",1395,1416,1425,1465,1474,1512,1565,1615,1643,1661,1720,1785,1804,1819,1844,1846,1841,1828,1839,1776,1822,1834,1852,1833,1843,1876,1907,1938,1981,1993,2039,{"$f":"_xlfn.RANK.EQ(tblAargau[[#This Row],[2011]],tblAargau[2011])","v":96},0.19068100358422946,3.2558139534883734E-2,0.11909989023051581,{"$f":"_xlfn.RANK.EQ(tblAargau[[#This Row],[2001-2011]],tblAargau[2001-2011])","v":108},0.46164874551971335,{"$f":"_xlfn.RANK.EQ(tblAargau[[#This Row],[1981-2011]],tblAargau[1981-2011])","v":94},11.22,{"$f":"_xlfn.RANK.EQ(tblAargau[[#This Row],[Fläche in km²]],tblAargau[Fläche in km²])","v":27},182,{"$f":"_xlfn.RANK.EQ(tblAargau[[#This Row],[Einwohner/km²]],tblAargau[Einwohner/km²])","v":163},86,{"$f":"_xlfn.RANK.EQ(tblAargau[[#This Row],[Tax]],tblAargau[Tax],1)","v":12}]
["Villmergen","Bremgarten",4093,4103,4081,4088,4178,4233,4372,4502,4606,4674,4909,4962,4955,4960,5152,5200,5209,5199,5200,5251,5288,5347,5362,5465,5464,5524,5505,5695,5840,5883,6106,{"$f":"_xlfn.RANK.EQ(tblAargau[[#This Row],[2011]],tblAargau[2011])","v":25},0.14194967016858051,6.9667956814015053E-2,0.15468986384266259,{"$f":"_xlfn.RANK.EQ(tblAargau[[#This Row],[2001-2011]],tblAargau[2001-2011])","v":72},0.49181529440508176,{"$f":"_xlfn.RANK.EQ(tblAargau[[#This Row],[1981-2011]],tblAargau[1981-2011])","v":89},11.94,{"$f":"_xlfn.RANK.EQ(tblAargau[[#This Row],[Fläche in km²]],tblAargau[Fläche in km²])","v":19},511,{"$f":"_xlfn.RANK.EQ(tblAargau[[#This Row],[Einwohner/km²]],tblAargau[Einwohner/km²])","v":70},92,{"$f":"_xlfn.RANK.EQ(tblAargau[[#This Row],[Tax]],tblAargau[Tax],1)","v":26}]
["Villnachern","Brugg",1066,1098,1161,1175,1199,1161,1196,1249,1272,1308,1279,1276,1283,1249,1238,1213,1224,1233,1234,1224,1259,1308,1327,1369,1368,1408,1446,1483,1483,1495,1505,{"$f":"_xlfn.RANK.EQ(tblAargau[[#This Row],[2011]],tblAargau[2011])","v":115},0.22701688555347088,-4.3002345582486279E-2,0.19539316918189042,{"$f":"_xlfn.RANK.EQ(tblAargau[[#This Row],[2001-2011]],tblAargau[2001-2011])","v":40},0.41181988742964348,{"$f":"_xlfn.RANK.EQ(tblAargau[[#This Row],[1981-2011]],tblAargau[1981-2011])","v":109},5.74,{"$f":"_xlfn.RANK.EQ(tblAargau[[#This Row],[Fläche in km²]],tblAargau[Fläche in km²])","v":101},262,{"$f":"_xlfn.RANK.EQ(tblAargau[[#This Row],[Einwohner/km²]],tblAargau[Einwohner/km²])","v":127},118,{"$f":"_xlfn.RANK.EQ(tblAargau[[#This Row],[Tax]],tblAargau[Tax],1)","v":178}]
["Vordemwald","Zofingen",1539,1578,1588,1590,1641,1643,1637,1654,1643,1635,1607,1619,1676,1674,1664,1646,1710,1744,1739,1765,1741,1711,1718,1702,1728,1714,1722,1715,1686,1697,1757,{"$f":"_xlfn.RANK.EQ(tblAargau[[#This Row],[2011]],tblAargau[2011])","v":106},6.2378167641325533E-2,9.8319850653391327E-2,9.1901206203330865E-3,{"$f":"_xlfn.RANK.EQ(tblAargau[[#This Row],[2001-2011]],tblAargau[2001-2011])","v":192},0.14165042235217684,{"$f":"_xlfn.RANK.EQ(tblAargau[[#This Row],[1981-2011]],tblAargau[1981-2011])","v":198},10.130000000000001,{"$f":"_xlfn.RANK.EQ(tblAargau[[#This Row],[Fläche in km²]],tblAargau[Fläche in km²])","v":33},173,{"$f":"_xlfn.RANK.EQ(tblAargau[[#This Row],[Einwohner/km²]],tblAargau[Einwohner/km²])","v":169},115,{"$f":"_xlfn.RANK.EQ(tblAargau[[#This Row],[Tax]],tblAargau[Tax],1)","v":150}]
["Wallbach","Rheinfelden",1113,1131,1132,1121,1135,1120,1166,1219,1240,1252,1272,1280,1319,1383,1392,1428,1452,1463,1486,1530,1549,1579,1589,1620,1643,1654,1710,1761,1794,1817,1831,{"$f":"_xlfn.RANK.EQ(tblAargau[[#This Row],[2011]],tblAargau[2011])","v":104},0.12488769092542684,0.20283018867924518,0.18205293737895412,{"$f":"_xlfn.RANK.EQ(tblAargau[[#This Row],[2001-2011]],tblAargau[2001-2011])","v":55},0.64510332434860729,{"$f":"_xlfn.RANK.EQ(tblAargau[[#This Row],[1981-2011]],tblAargau[1981-2011])","v":61},4.51,{"$f":"_xlfn.RANK.EQ(tblAargau[[#This Row],[Fläche in km²]],tblAargau[Fläche in km²])","v":135},406,{"$f":"_xlfn.RANK.EQ(tblAargau[[#This Row],[Einwohner/km²]],tblAargau[Einwohner/km²])","v":88},100,{"$f":"_xlfn.RANK.EQ(tblAargau[[#This Row],[Tax]],tblAargau[Tax],1)","v":60}]
["Waltenschwil","Muri",1267,1362,1407,1425,1453,1494,1506,1586,1633,1691,1779,1799,1818,1839,1862,1879,1998,1987,1995,2029,2116,2153,2131,2193,2218,2206,2266,2370,2426,2494,2559,{"$f":"_xlfn.RANK.EQ(tblAargau[[#This Row],[2011]],tblAargau[2011])","v":80},0.33464877663772685,0.14052838673412027,0.20935727788279768,{"$f":"_xlfn.RANK.EQ(tblAargau[[#This Row],[2001-2011]],tblAargau[2001-2011])","v":33},1.0197316495659039,{"$f":"_xlfn.RANK.EQ(tblAargau[[#This Row],[1981-2011]],tblAargau[1981-2011])","v":22},4.5599999999999996,{"$f":"_xlfn.RANK.EQ(tblAargau[[#This Row],[Fläche in km²]],tblAargau[Fläche in km²])","v":133},561,{"$f":"_xlfn.RANK.EQ(tblAargau[[#This Row],[Einwohner/km²]],tblAargau[Einwohner/km²])","v":62},102,{"$f":"_xlfn.RANK.EQ(tblAargau[[#This Row],[Tax]],tblAargau[Tax],1)","v":75}]
["Wegenstetten","Rheinfelden",667,684,701,722,743,759,771,798,822,851,886,904,948,955,984,1007,1014,994,1004,991,1000,1023,1021,1047,1070,1078,1077,1098,1079,1067,1053,{"$f":"_xlfn.RANK.EQ(tblAargau[[#This Row],[2011]],tblAargau[2011])","v":145},0.27586206896551735,0.11851015801354392,5.2999999999999936E-2,{"$f":"_xlfn.RANK.EQ(tblAargau[[#This Row],[2001-2011]],tblAargau[2001-2011])","v":159},0.57871064467766109,{"$f":"_xlfn.RANK.EQ(tblAargau[[#This Row],[1981-2011]],tblAargau[1981-2011])","v":70},7.13,{"$f":"_xlfn.RANK.EQ(tblAargau[[#This Row],[Fläche in km²]],tblAargau[Fläche in km²])","v":70},148,{"$f":"_xlfn.RANK.EQ(tblAargau[[#This Row],[Einwohner/km²]],tblAargau[Einwohner/km²])","v":179},121,{"$f":"_xlfn.RANK.EQ(tblAargau[[#This Row],[Tax]],tblAargau[Tax],1)","v":200}]
["Wettingen","Baden",18224,18296,18280,18144,17935,17799,17740,17631,17631,17519,17616,17561,17793,17790,17795,17795,17682,17601,17599,17739,18034,18166,18181,18192,18318,18618,19039,19430,19599,19813,20230,{"$f":"_xlfn.RANK.EQ(tblAargau[[#This Row],[2011]],tblAargau[2011])","v":1},-3.8685250219490763E-2,6.9822888283379569E-3,0.12176999001885336,{"$f":"_xlfn.RANK.EQ(tblAargau[[#This Row],[2001-2011]],tblAargau[2001-2011])","v":103},0.1100746268656716,{"$f":"_xlfn.RANK.EQ(tblAargau[[#This Row],[1981-2011]],tblAargau[1981-2011])","v":207},10.61,{"$f":"_xlfn.RANK.EQ(tblAargau[[#This Row],[Fläche in km²]],tblAargau[Fläche in km²])","v":30},1907,{"$f":"_xlfn.RANK.EQ(tblAargau[[#This Row],[Einwohner/km²]],tblAargau[Einwohner/km²])","v":1},89,{"$f":"_xlfn.RANK.EQ(tblAargau[[#This Row],[Tax]],tblAargau[Tax],1)","v":19}]
["Widen","Bremgarten",2821,2983,3215,3393,3550,3717,3794,3931,3910,3920,3874,3892,3878,3846,3829,3793,3709,3641,3600,3567,3574,3569,3586,3626,3503,3596,3562,3556,3528,3525,3533,{"$f":"_xlfn.RANK.EQ(tblAargau[[#This Row],[2011]],tblAargau[2011])","v":60},0.38957816377171217,-7.924625709860611E-2,-1.1471740346950199E-2,{"$f":"_xlfn.RANK.EQ(tblAargau[[#This Row],[2001-2011]],tblAargau[2001-2011])","v":201},0.25239276852180081,{"$f":"_xlfn.RANK.EQ(tblAargau[[#This Row],[1981-2011]],tblAargau[1981-2011])","v":172},2.61,{"$f":"_xlfn.RANK.EQ(tblAargau[[#This Row],[Fläche in km²]],tblAargau[Fläche in km²])","v":196},1354,{"$f":"_xlfn.RANK.EQ(tblAargau[[#This Row],[Einwohner/km²]],tblAargau[Einwohner/km²])","v":12},86,{"$f":"_xlfn.RANK.EQ(tblAargau[[#This Row],[Tax]],tblAargau[Tax],1)","v":12}]
["Wiliberg","Zofingen",121,117,116,126,124,120,129,135,134,143,147,145,152,153,158,153,151,160,161,157,154,156,158,153,153,156,155,160,157,155,168,{"$f":"_xlfn.RANK.EQ(tblAargau[[#This Row],[2011]],tblAargau[2011])","v":216},0.18181818181818188,6.8027210884353817E-2,9.0909090909090828E-2,{"$f":"_xlfn.RANK.EQ(tblAargau[[#This Row],[2001-2011]],tblAargau[2001-2011])","v":130},0.38842975206611574,{"$f":"_xlfn.RANK.EQ(tblAargau[[#This Row],[1981-2011]],tblAargau[1981-2011])","v":120},1.17,{"$f":"_xlfn.RANK.EQ(tblAargau[[#This Row],[Fläche in km²]],tblAargau[Fläche in km²])","v":216},144,{"$f":"_xlfn.RANK.EQ(tblAargau[[#This Row],[Einwohner/km²]],tblAargau[Einwohner/km²])","v":180},115,{"$f":"_xlfn.RANK.EQ(tblAargau[[#This Row],[Tax]],tblAargau[Tax],1)","v":150}]
["Windisch","Brugg",7631,7526,7455,7477,7325,7187,7132,7042,6973,6927,6496,6471,6472,6391,6382,6388,6357,6362,6437,6509,6549,6618,6677,6697,6691,6672,6642,6640,6659,6592,6761,{"$f":"_xlfn.RANK.EQ(tblAargau[[#This Row],[2011]],tblAargau[2011])","v":23},-9.2255274538068366E-2,2.0012315270936387E-3,3.2371354405252628E-2,{"$f":"_xlfn.RANK.EQ(tblAargau[[#This Row],[2001-2011]],tblAargau[2001-2011])","v":174},-0.11400864893198792,{"$f":"_xlfn.RANK.EQ(tblAargau[[#This Row],[1981-2011]],tblAargau[1981-2011])","v":219},4.91,{"$f":"_xlfn.RANK.EQ(tblAargau[[#This Row],[Fläche in km²]],tblAargau[Fläche in km²])","v":123},1377,{"$f":"_xlfn.RANK.EQ(tblAargau[[#This Row],[Einwohner/km²]],tblAargau[Einwohner/km²])","v":9},118,{"$f":"_xlfn.RANK.EQ(tblAargau[[#This Row],[Tax]],tblAargau[Tax],1)","v":178}]
["Wislikofen","Zurzach",288,289,300,299,302,306,324,329,338,356,376,377,388,379,361,349,369,357,344,341,344,337,343,348,334,331,327,328,323,326,336,{"$f":"_xlfn.RANK.EQ(tblAargau[[#This Row],[2011]],tblAargau[2011])","v":207},0.23611111111111116,-9.3085106382978733E-2,-2.3255813953488413E-2,{"$f":"_xlfn.RANK.EQ(tblAargau[[#This Row],[2001-2011]],tblAargau[2001-2011])","v":203},0.16666666666666674,{"$f":"_xlfn.RANK.EQ(tblAargau[[#This Row],[1981-2011]],tblAargau[1981-2011])","v":193},3.75,{"$f":"_xlfn.RANK.EQ(tblAargau[[#This Row],[Fläche in km²]],tblAargau[Fläche in km²])","v":160},90,{"$f":"_xlfn.RANK.EQ(tblAargau[[#This Row],[Einwohner/km²]],tblAargau[Einwohner/km²])","v":206},117,{"$f":"_xlfn.RANK.EQ(tblAargau[[#This Row],[Tax]],tblAargau[Tax],1)","v":168}]
["Wittnau","Laufenburg",800,792,787,791,793,812,858,851,851,892,952,971,968,993,1044,1055,1080,1146,1154,1136,1150,1135,1127,1111,1118,1127,1106,1126,1143,1151,1162,{"$f":"_xlfn.RANK.EQ(tblAargau[[#This Row],[2011]],tblAargau[2011])","v":142},0.11499999999999999,0.19327731092436973,1.0434782608695681E-2,{"$f":"_xlfn.RANK.EQ(tblAargau[[#This Row],[2001-2011]],tblAargau[2001-2011])","v":191},0.4524999999999999,{"$f":"_xlfn.RANK.EQ(tblAargau[[#This Row],[1981-2011]],tblAargau[1981-2011])","v":97},11.25,{"$f":"_xlfn.RANK.EQ(tblAargau[[#This Row],[Fläche in km²]],tblAargau[Fläche in km²])","v":26},103,{"$f":"_xlfn.RANK.EQ(tblAargau[[#This Row],[Einwohner/km²]],tblAargau[Einwohner/km²])","v":198},121,{"$f":"_xlfn.RANK.EQ(tblAargau[[#This Row],[Tax]],tblAargau[Tax],1)","v":200}]
["Wohlen (AG)","Bremgarten",11593,11480,11434,11394,11484,11553,11774,11982,12039,12119,12376,12455,12626,12773,12892,12874,12878,12926,13094,13223,13514,13687,13787,13887,14035,14086,14091,14120,14303,14416,14623,{"$f":"_xlfn.RANK.EQ(tblAargau[[#This Row],[2011]],tblAargau[2011])","v":4},4.5372207366514372E-2,6.84389140271493E-2,8.2063045730353723E-2,{"$f":"_xlfn.RANK.EQ(tblAargau[[#This Row],[2001-2011]],tblAargau[2001-2011])","v":139},0.26136461657897003,{"$f":"_xlfn.RANK.EQ(tblAargau[[#This Row],[1981-2011]],tblAargau[1981-2011])","v":167},12.48,{"$f":"_xlfn.RANK.EQ(tblAargau[[#This Row],[Fläche in km²]],tblAargau[Fläche in km²])","v":16},1172,{"$f":"_xlfn.RANK.EQ(tblAargau[[#This Row],[Einwohner/km²]],tblAargau[Einwohner/km²])","v":16},113,{"$f":"_xlfn.RANK.EQ(tblAargau[[#This Row],[Tax]],tblAargau[Tax],1)","v":139}]
["Wohlenschwil","Baden",842,900,894,922,940,951,955,969,1040,1072,1131,1135,1135,1183,1203,1219,1277,1260,1252,1248,1250,1279,1278,1271,1287,1299,1322,1331,1351,1417,1478,{"$f":"_xlfn.RANK.EQ(tblAargau[[#This Row],[2011]],tblAargau[2011])","v":117},0.27315914489311166,0.10344827586206895,0.1823999999999999,{"$f":"_xlfn.RANK.EQ(tblAargau[[#This Row],[2001-2011]],tblAargau[2001-2011])","v":54},0.75534441805225661,{"$f":"_xlfn.RANK.EQ(tblAargau[[#This Row],[1981-2011]],tblAargau[1981-2011])","v":44},4.3899999999999997,{"$f":"_xlfn.RANK.EQ(tblAargau[[#This Row],[Fläche in km²]],tblAargau[Fläche in km²])","v":140},337,{"$f":"_xlfn.RANK.EQ(tblAargau[[#This Row],[Einwohner/km²]],tblAargau[Einwohner/km²])","v":105},122,{"$f":"_xlfn.RANK.EQ(tblAargau[[#This Row],[Tax]],tblAargau[Tax],1)","v":206}]
["Wölflinswil","Laufenburg",732,722,709,689,681,691,694,707,710,698,755,742,755,799,808,834,831,813,815,811,808,799,840,846,843,856,873,907,945,987,980,{"$f":"_xlfn.RANK.EQ(tblAargau[[#This Row],[2011]],tblAargau[2011])","v":157},-4.6448087431694041E-2,7.4172185430463555E-2,0.21287128712871284,{"$f":"_xlfn.RANK.EQ(tblAargau[[#This Row],[2001-2011]],tblAargau[2001-2011])","v":31},0.33879781420765021,{"$f":"_xlfn.RANK.EQ(tblAargau[[#This Row],[1981-2011]],tblAargau[1981-2011])","v":141},9.51,{"$f":"_xlfn.RANK.EQ(tblAargau[[#This Row],[Fläche in km²]],tblAargau[Fläche in km²])","v":40},103,{"$f":"_xlfn.RANK.EQ(tblAargau[[#This Row],[Einwohner/km²]],tblAargau[Einwohner/km²])","v":198},122,{"$f":"_xlfn.RANK.EQ(tblAargau[[#This Row],[Tax]],tblAargau[Tax],1)","v":206}]
["Würenlingen","Baden",2739,2741,2744,2836,2872,2883,2886,2997,2961,3003,3152,3212,3213,3301,3372,3441,3500,3503,3604,3654,3675,3726,3701,3735,3767,3775,3816,4019,4119,4220,4245,{"$f":"_xlfn.RANK.EQ(tblAargau[[#This Row],[2011]],tblAargau[2011])","v":41},9.6385542168674787E-2,0.15926395939086291,0.15510204081632661,{"$f":"_xlfn.RANK.EQ(tblAargau[[#This Row],[2001-2011]],tblAargau[2001-2011])","v":69},0.54983570646221258,{"$f":"_xlfn.RANK.EQ(tblAargau[[#This Row],[1981-2011]],tblAargau[1981-2011])","v":78},9.3800000000000008,{"$f":"_xlfn.RANK.EQ(tblAargau[[#This Row],[Fläche in km²]],tblAargau[Fläche in km²])","v":43},453,{"$f":"_xlfn.RANK.EQ(tblAargau[[#This Row],[Einwohner/km²]],tblAargau[Einwohner/km²])","v":80},95,{"$f":"_xlfn.RANK.EQ(tblAargau[[#This Row],[Tax]],tblAargau[Tax],1)","v":30}]
["Würenlos","Baden",3198,3232,3367,3495,3579,3784,3887,3983,4059,4031,4108,4136,4211,4274,4385,4419,4575,4695,4783,4762,4801,4852,4982,5093,5180,5165,5227,5221,5333,5642,5785,{"$f":"_xlfn.RANK.EQ(tblAargau[[#This Row],[2011]],tblAargau[2011])","v":27},0.26047529706066297,0.15920155793573509,0.20495730056238282,{"$f":"_xlfn.RANK.EQ(tblAargau[[#This Row],[2001-2011]],tblAargau[2001-2011])","v":36},0.80894308943089421,{"$f":"_xlfn.RANK.EQ(tblAargau[[#This Row],[1981-2011]],tblAargau[1981-2011])","v":41},9.02,{"$f":"_xlfn.RANK.EQ(tblAargau[[#This Row],[Fläche in km²]],tblAargau[Fläche in km²])","v":44},641,{"$f":"_xlfn.RANK.EQ(tblAargau[[#This Row],[Einwohner/km²]],tblAargau[Einwohner/km²])","v":49},104,{"$f":"_xlfn.RANK.EQ(tblAargau[[#This Row],[Tax]],tblAargau[Tax],1)","v":87}]
["Zeihen","Laufenburg",675,678,688,684,660,658,666,697,706,686,725,728,765,780,800,840,841,841,857,861,863,879,884,918,903,908,949,967,940,975,1024,{"$f":"_xlfn.RANK.EQ(tblAargau[[#This Row],[2011]],tblAargau[2011])","v":150},1.6296296296296253E-2,0.1875862068965517,0.18655851680185398,{"$f":"_xlfn.RANK.EQ(tblAargau[[#This Row],[2001-2011]],tblAargau[2001-2011])","v":48},0.51703703703703696,{"$f":"_xlfn.RANK.EQ(tblAargau[[#This Row],[1981-2011]],tblAargau[1981-2011])","v":84},6.88,{"$f":"_xlfn.RANK.EQ(tblAargau[[#This Row],[Fläche in km²]],tblAargau[Fläche in km²])","v":78},149,{"$f":"_xlfn.RANK.EQ(tblAargau[[#This Row],[Einwohner/km²]],tblAargau[Einwohner/km²])","v":178},117,{"$f":"_xlfn.RANK.EQ(tblAargau[[#This Row],[Tax]],tblAargau[Tax],1)","v":168}]
["Zeiningen","Rheinfelden",1374,1362,1384,1406,1455,1461,1485,1512,1558,1587,1669,1644,1644,1674,1740,1745,1746,1786,1800,1821,1843,1889,1969,2007,2079,2118,2156,2183,2180,2197,2201,{"$f":"_xlfn.RANK.EQ(tblAargau[[#This Row],[2011]],tblAargau[2011])","v":88},0.15502183406113534,9.1072498502096977E-2,0.19424850786760706,{"$f":"_xlfn.RANK.EQ(tblAargau[[#This Row],[2001-2011]],tblAargau[2001-2011])","v":41},0.60189228529839878,{"$f":"_xlfn.RANK.EQ(tblAargau[[#This Row],[1981-2011]],tblAargau[1981-2011])","v":66},11.37,{"$f":"_xlfn.RANK.EQ(tblAargau[[#This Row],[Fläche in km²]],tblAargau[Fläche in km²])","v":23},194,{"$f":"_xlfn.RANK.EQ(tblAargau[[#This Row],[Einwohner/km²]],tblAargau[Einwohner/km²])","v":158},107,{"$f":"_xlfn.RANK.EQ(tblAargau[[#This Row],[Tax]],tblAargau[Tax],1)","v":103}]
["Zetzwil","Kulm",1031,1074,1130,1158,1169,1206,1212,1223,1231,1244,1204,1199,1190,1164,1179,1192,1205,1207,1212,1202,1209,1222,1219,1217,1227,1229,1236,1250,1244,1232,1274,{"$f":"_xlfn.RANK.EQ(tblAargau[[#This Row],[2011]],tblAargau[2011])","v":133},0.20659553831231814,-1.6611295681062677E-3,5.3763440860215006E-2,{"$f":"_xlfn.RANK.EQ(tblAargau[[#This Row],[2001-2011]],tblAargau[2001-2011])","v":158},0.2356935014548982,{"$f":"_xlfn.RANK.EQ(tblAargau[[#This Row],[1981-2011]],tblAargau[1981-2011])","v":178},5.8,{"$f":"_xlfn.RANK.EQ(tblAargau[[#This Row],[Fläche in km²]],tblAargau[Fläche in km²])","v":98},220,{"$f":"_xlfn.RANK.EQ(tblAargau[[#This Row],[Einwohner/km²]],tblAargau[Einwohner/km²])","v":139},116,{"$f":"_xlfn.RANK.EQ(tblAargau[[#This Row],[Tax]],tblAargau[Tax],1)","v":164}]
["Zofingen","Zofingen",9215,9192,9145,8944,8983,9004,8999,9021,9075,9082,9318,9356,9470,9433,9276,9309,9209,9206,9309,9388,9585,9708,9926,10109,10228,10394,10564,10580,10623,10774,10990,{"$f":"_xlfn.RANK.EQ(tblAargau[[#This Row],[2011]],tblAargau[2011])","v":7},-1.4432989690721598E-2,7.5123417042284313E-3,0.14658320292123106,{"$f":"_xlfn.RANK.EQ(tblAargau[[#This Row],[2001-2011]],tblAargau[2001-2011])","v":81},0.19262072707542055,{"$f":"_xlfn.RANK.EQ(tblAargau[[#This Row],[1981-2011]],tblAargau[1981-2011])","v":189},11.09,{"$f":"_xlfn.RANK.EQ(tblAargau[[#This Row],[Fläche in km²]],tblAargau[Fläche in km²])","v":28},991,{"$f":"_xlfn.RANK.EQ(tblAargau[[#This Row],[Einwohner/km²]],tblAargau[Einwohner/km²])","v":25},102,{"$f":"_xlfn.RANK.EQ(tblAargau[[#This Row],[Tax]],tblAargau[Tax],1)","v":75}]
["Zufikon","Bremgarten",2793,3040,3151,3282,3358,3487,3477,3480,3515,3496,3477,3490,3512,3522,3500,3478,3437,3460,3526,3547,3603,3648,3670,3646,3662,3849,3928,3947,4062,4147,4265,{"$f":"_xlfn.RANK.EQ(tblAargau[[#This Row],[2011]],tblAargau[2011])","v":39},0.2517006802721089,2.0132297958009859E-2,0.18373577574243694,{"$f":"_xlfn.RANK.EQ(tblAargau[[#This Row],[2001-2011]],tblAargau[2001-2011])","v":52},0.52703186537772995,{"$f":"_xlfn.RANK.EQ(tblAargau[[#This Row],[1981-2011]],tblAargau[1981-2011])","v":82},4.8099999999999996,{"$f":"_xlfn.RANK.EQ(tblAargau[[#This Row],[Fläche in km²]],tblAargau[Fläche in km²])","v":129},887,{"$f":"_xlfn.RANK.EQ(tblAargau[[#This Row],[Einwohner/km²]],tblAargau[Einwohner/km²])","v":31},88,{"$f":"_xlfn.RANK.EQ(tblAargau[[#This Row],[Tax]],tblAargau[Tax],1)","v":16}]
["Zuzgen","Rheinfelden",537,534,543,548,568,573,575,596,611,616,641,648,650,655,657,676,734,751,749,737,762,815,806,814,805,800,811,840,847,845,839,{"$f":"_xlfn.RANK.EQ(tblAargau[[#This Row],[2011]],tblAargau[2011])","v":170},0.14711359404096824,0.14976599063962559,0.10104986876640409,{"$f":"_xlfn.RANK.EQ(tblAargau[[#This Row],[2001-2011]],tblAargau[2001-2011])","v":124},0.56238361266294223,{"$f":"_xlfn.RANK.EQ(tblAargau[[#This Row],[1981-2011]],tblAargau[1981-2011])","v":75},8.39,{"$f":"_xlfn.RANK.EQ(tblAargau[[#This Row],[Fläche in km²]],tblAargau[Fläche in km²])","v":55},100,{"$f":"_xlfn.RANK.EQ(tblAargau[[#This Row],[Einwohner/km²]],tblAargau[Einwohner/km²])","v":200},122,{"$f":"_xlfn.RANK.EQ(tblAargau[[#This Row],[Tax]],tblAargau[Tax],1)","v":206}]
["Gesamt",null,{"$f":"SUBTOTAL(109,tblAargau[1981])","v":455019},{"$f":"SUBTOTAL(109,tblAargau[1982])","v":458631},{"$f":"SUBTOTAL(109,tblAargau[1983])","v":461595},{"$f":"SUBTOTAL(109,tblAargau[1984])","v":464265},{"$f":"SUBTOTAL(109,tblAargau[1985])","v":467815},{"$f":"SUBTOTAL(109,tblAargau[1986])","v":472351},{"$f":"SUBTOTAL(109,tblAargau[1987])","v":478177},{"$f":"SUBTOTAL(109,tblAargau[1988])","v":483959},{"$f":"SUBTOTAL(109,tblAargau[1989])","v":490052},{"$f":"SUBTOTAL(109,tblAargau[1990])","v":495890},{"$f":"SUBTOTAL(109,tblAargau[1991])","v":506387},{"$f":"SUBTOTAL(109,tblAargau[1992])","v":511530},{"$f":"SUBTOTAL(109,tblAargau[1993])","v":518480},{"$f":"SUBTOTAL(109,tblAargau[1994])","v":522623},{"$f":"SUBTOTAL(109,tblAargau[1995])","v":528389},{"$f":"SUBTOTAL(109,tblAargau[1996])","v":531151},{"$f":"SUBTOTAL(109,tblAargau[1997])","v":533502},{"$f":"SUBTOTAL(109,tblAargau[1998])","v":535929},{"$f":"SUBTOTAL(109,tblAargau[1999])","v":540092},{"$f":"SUBTOTAL(109,tblAargau[2000])","v":543788},{"$f":"SUBTOTAL(109,tblAargau[2001])","v":549762},{"$f":"SUBTOTAL(109,tblAargau[2002])","v":555234},{"$f":"SUBTOTAL(109,tblAargau[2003])","v":560133},{"$f":"SUBTOTAL(109,tblAargau[2004])","v":564579},{"$f":"SUBTOTAL(109,tblAargau[2005])","v":568810},{"$f":"SUBTOTAL(109,tblAargau[2006])","v":574277},{"$f":"SUBTOTAL(109,tblAargau[2007])","v":581015},{"$f":"SUBTOTAL(109,tblAargau[2008])","v":591077},{"$f":"SUBTOTAL(109,tblAargau[2009])","v":599487},{"$f":"SUBTOTAL(109,tblAargau[2010])","v":607749},{"$f":"SUBTOTAL(109,tblAargau[2011])","v":621398},null,{"$f":"IFERROR(L221/C221-1,0)","v":8.9822622791575712E-2},{"$f":"IFERROR(V221/M221-1,0)","v":7.3858531123429216E-2},{"$f":"IFERROR(AF221/W221-1,0)","v":0.10547655167145065},null,{"$f":"IFERROR(AF221/C221-1,0)","v":0.33565631325285317},null,{"$f":"SUBTOTAL(109,tblAargau[Fläche in km²])","v":1395.0599999999993},null,{"$f":"AG221/AO221","v":445.4274368127538}]
[]
["Aargau",null,455019,458631,461595,464265,467815,472351,478177,483959,490052,495890,506387,511530,518480,522623,528389,531151,533502,535929,540092,543788,549762,555234,560133,564579,568810,574277,581015,591077,599487,607749,621398,8.9822622791575712E-2,7.3858531123429216E-2,0.10547655167145065,null,0.33565631325285317,null,1395.059999999999,445.42743681275385]
["Schweiz",null,6372904,6409713,6427833,6455896,6484834,6523413,6566799,6619973,6673850,6750693,6842768,6907959,6968570,7019019,7062354,7081346,7096465,7123537,7164444,7204055,7255653,7313853,7364148,7415102,7459128,7508739,7593494,7701856,7785806,7864012,7952600,{"$f":"IFERROR(L224/C224-1,0)","v":5.9280510109676943E-2},{"$f":"IFERROR(V224/M224-1,0)","v":5.2798370483991164E-2},{"$f":"IFERROR(AG224/W224-1,0)","v":9.605572372328175E-2},null,{"$f":"IFERROR(AG224/C224-1,0)","v":0.24787694903296842},null,41285,187]
[]
[]
["Daten sind aus folgenden Quellen:"]
["Schweizerische Bundesamt für Statistik"]
["Wikipedia"]
["Aargauisches Steueramt"]

{"sheet":"Metadata","index":2,"n_rows":30,"n_cols":4,"rows_kept":30,"cut":false,"hidden":false,"merged":[]}
[" Merkmal / Désignation du caractère"," Kurzbeschreibung",null,"Brève description"]
["GMDENAME","Gemeindename",null,"Nom de la commune"]
["XMIN"," Minimale x-Koordinate des Gebiets [m]  ",null,"Coordonnée x minimale du territoire [m] "]
["YMIN"," Minimale y-Koordinate des Gebiets [m]  ",null,"Coordonnée y minimale du territoire [m] "]
["XMAX"," Maximale x-Koordinate des Gebiets [m]  ",null,"Coordonnée x maximale du territoire [m] "]
["YMAX"," Maximale y-Koordinate des Gebiets [m]  ",null,"Coordonnée y maximale du territoire [m] "]
["ZMIN"," Minimale Höhe (z-Koordinate) des Gebiets [m über Meer]",null,"Altitude minimale (coordonnée z) du territoire [m au-dessus de la mer] "]
["ZMAX"," Maximale Höhe (z-Koordinate) des Gebiets [m über Meer]  ",null,"Altitude maximale (coordonnée z) du territoire [m au-dessus de la mer] "]
["ZKZ"," Höhe (z-Koordinate) der Zentrumskoordinate [m über Meer]  ",null,"Altitude (coordonnée z) de la coordonnée centrale [m au-dessus de la mer] "]
["ZKX"," x-Koordinate der Zentrumskoordinate  [Hektometer]  ",null,"Coordonnée hectométrique x de la coordonnée centrale "]
["ZKY"," y-Koordinate der Zentrumskoordinate  [Hektometer]  ",null,"Coordonnée hectométrique y de la coordonnée centrale "]
["ZMEAN"," Mittlere Höhe des Gebiets [m über Meer]  ",null,"Altitude moyenne du territoire [m au-dessus de la mer] "]
["ZMED"," Medianhöhe des Gebiets [m über Meer]  ",null,"Altitude médiane du territoire [m au-dessus de la mer] "]
[" "]
["*NUTS: Nomenclature des unités territoriales statistiques / EUROSTAT"]
[]
[]
["BFS / OFS"]
["GEOSTAT"]
["2010 Neuchâtel"]
[]
[]
["In der Berechnung verwendete Grundlagedaten:"]
["Données de base utilisées dans les calculs:"]
[]
["DHM25 Digitales Höhenmodell / MNT25 modèle numérique du terrain © swisstopo"]
["GG25 administrative Grenzen / limites administratives (GG25) © swisstopo, 1.1.2008 mit bis 1.1.2009 nachgeführten Gemeindefusionen"]
["Zugehörigkeit der Hektaren zu den administrativen Einheiten der Schweiz  BFS GEOSTAT, 1.1.2008 mit bis 1.1.2009 nachgeführten Gemeindefusionen"]
["Limites administratives (GG25) © swisstopo, 1.1.2008, fusions de communes respectées jusqu'au 1er janvier 2009"]
["Appartenances des hectares aux unités administratives de la Suisse  BFS GEOSTAT, 1.1.2008, fusions de communes respectées jusqu'au 1er janvier 2009"]

{"sheet":"GeoDaten","index":3,"n_rows":231,"n_cols":12,"rows_kept":231,"cut":false,"hidden":false,"merged":[]}
["GMDENAME","XMIN","YMIN","XMAX","YMAX","ZKX","ZKY","ZKZ","ZMIN","ZMAX","ZMEAN","ZMED"]
["Aarau",644377,246725,647749,251106,645800,249000,387,359,486,399,393]
["Biberstein",647453,251210,650216,253337,648500,251600,378,357,770,507,482]
["Buchs (AG)",647185,247927,651181,250745,647600,248700,388,367,394,382,383]
["Densbüren",644474,253626,649300,257513,646300,256100,505,438,849,608,600]
["Erlinsbach (AG)",639583,249403,645089,253518,643200,250100,410,370,894,587,559]
["Gränichen",647754,242373,653233,247712,650000,245400,413,401,629,488,485]
["Hirschthal",645715,240051,649065,241804,646500,241400,442,437,650,509,501]
["Küttigen",643439,250088,647688,254278,646000,251800,413,358,861,527,498]
["Muhen",645532,241301,648945,244231,646500,243400,429,421,635,488,478]
["Oberentfelden",643203,243710,647835,246263,645900,245200,413,410,595,442,421]
["Rohr (AG)",647313,249735,650938,251495,648500,250400,363,358,381,365,361]
["Suhr",646517,244427,651162,250158,648400,246900,396,379,577,414,404]
["Unterentfelden",644144,245617,646885,247570,645700,246400,416,406,485,428,421]
["Baden",662049,253899,666396,259753,665400,258400,425,337,581,457,451]
["Bellikon",667460,247546,669909,250952,668400,249100,595,501,785,651,648]
["Bergdietikon",669381,247075,672664,250747,671600,249000,502,408,780,579,590]
["Birmenstorf (AG)",659444,253585,663508,258389,661000,257100,385,336,569,405,396]
["Ennetbaden",665669,258399,668058,259929,666100,259100,360,346,731,479,471]
["Fislisbach",662620,253021,666046,255581,664400,254300,428,407,645,446,425]
["Freienwil",664171,259895,667772,262550,666900,261800,463,429,622,532,518]
["Gebenstorf",659221,257628,662678,262007,660600,259100,376,327,562,428,426]
["Killwangen",667181,252282,669497,254432,669000,253900,408,380,695,514,504]
["Künten",665469,247495,668589,250415,667300,249100,424,356,526,415,412]
["Mägenwil",658689,250462,661287,253155,659700,251500,420,399,553,443,423]
["Mellingen",661480,250949,664389,254153,663000,252300,349,345,439,378,375]
["Neuenhof",665289,253380,668461,256949,667200,255400,405,358,703,472,444]
["Niederrohrdorf",663995,251115,666276,254225,665400,252900,436,377,522,430,426]
["Oberrohrdorf",665315,251649,668117,254897,666300,252400,498,445,699,585,591]
["Obersiggenthal",662298,259374,666855,263067,664600,260000,388,336,618,482,488]
["Remetschwil",665357,250165,669229,252184,667000,251200,525,400,700,560,562]
["Spreitenbach",668104,250405,671957,254214,669900,252300,419,380,705,468,418]
["Stetten (AG)",663751,248522,666803,251784,665600,250200,386,347,427,388,391]
["Turgi",660926,259055,663318,261011,661200,260500,348,335,550,390,371]
["Untersiggenthal",659828,260058,663388,263494,661500,261600,375,327,590,436,429]
["Wettingen",665585,255292,670613,259387,666300,257800,390,356,853,476,447]
["Wohlenschwil",660265,250427,662637,253637,661800,251600,384,347,540,402,398]
["Würenlingen",659219,262889,663544,266682,661700,264800,370,327,553,386,358]
["Würenlos",667735,251220,675619,257686,669800,255100,410,380,559,437,426]
["Ehrendingen",666842,259040,669684,262781,668700,261600,448,427,809,519,499]
["Arni (AG)",673186,239392,675426,242550,674200,241300,570,519,635,581,581]
["Berikon",669480,243789,673335,246459,670800,244800,552,508,665,587,577]
["Bremgarten (AG)",665142,243377,669059,247202,668400,244800,383,359,470,400,390]
["Büttikon",661581,241198,664173,243376,662800,242000,500,456,570,513,510]
["Dottikon",659496,246568,662366,249915,660500,248400,415,405,542,432,420]
["Eggenwil",666886,245593,668978,248186,668100,247000,395,356,552,406,386]
["Fischbach-Göslikon",664531,245722,667228,247876,665900,246900,373,355,466,387,385]
["Hägglingen",659966,247230,663594,250946,661600,248800,474,443,587,513,516]
["Hermetschwil-Staffeln",666601,241444,669925,243574,668400,242700,408,379,473,427,435]
["Hilfikon",659853,241729,661849,243313,661100,242800,473,459,641,531,516]
["Jonen",670848,237890,674909,240528,672200,238800,398,381,556,440,440]
["Niederwil (AG)",663268,245984,665654,250207,664600,247800,404,348,502,418,412]
["Oberlunkhofen",671123,239643,673993,241752,672100,240500,450,380,576,474,489]
["Oberwil-Lieli",670509,242248,673930,245051,671600,243200,557,465,672,576,583]
["Rudolfstetten-Friedlisberg",669946,245772,673235,248013,671100,246800,478,447,659,555,555]
["Sarmenstorf",659579,238587,663721,242113,661200,240300,532,506,705,578,565]
["Tägerig",662234,248768,664631,251434,663400,250500,391,347,513,417,395]
["Uezwil",662485,239322,664320,241807,663300,240900,531,514,631,559,558]
["Unterlunkhofen",668847,240168,673568,243305,671300,241600,405,378,593,446,422]
["Villmergen",658421,242684,662487,247953,660900,244400,431,408,710,483,438]
["Widen",668422,245870,670284,248410,669800,246800,563,429,733,565,558]
["Wohlen (AG)",661312,242881,666559,247395,663400,244700,423,409,546,447,438]
["Zufikon",667946,242817,670788,246276,669600,244200,405,379,540,432,412]
["Islisberg",674946,240940,676827,243155,675700,241800,679,582,679,648,651]
["Auenstein",649713,251308,654487,253095,652900,252000,366,348,751,451,424]
["Birr",656513,252699,659973,254850,657500,254300,408,392,630,426,405]
["Birrhard",659609,252863,661766,255730,660800,254400,397,336,417,394,399]
["Bözen",647843,259155,650182,262572,648600,260600,404,398,579,456,449]
["Brugg",655158,257100,660178,262214,657900,259400,352,327,516,360,346]
["Effingen",649083,258172,652261,262861,650100,260100,430,418,648,513,501]
["Elfingen",648466,261283,651323,263443,649800,262000,457,428,656,533,529]
["Gallenkirch",650672,258360,652487,259697,651900,258900,568,490,583,558,562]
["Habsburg",655213,255952,657441,258136,656300,257100,464,373,498,441,447]
["Hausen (AG)",656808,256018,659245,258323,658300,257100,381,360,463,405,404]
["Hottwil",653477,264560,655905,267613,654400,266600,409,398,642,502,498]
["Linn",650298,256817,652832,259037,651900,257900,568,482,753,582,568]
["Lupfig",655904,253104,660466,256424,657700,254800,394,384,611,413,393]
["Mandach",655028,265560,657914,268547,656200,266500,491,410,626,523,524]
["Mönthal",650718,262267,654259,264182,652900,263300,482,441,666,535,535]
["Mülligen",659051,255140,661766,256937,660400,256600,365,336,493,388,390]
["Oberbözberg",651927,260480,656108,262582,654200,261000,538,406,642,534,539]
["Oberflachs",650665,253007,652650,255667,652200,254700,398,388,733,519,505]
["Remigen",653481,261573,658068,264985,656500,263100,395,369,694,476,458]
["Riniken",654782,259335,657937,262071,656500,260600,392,373,513,425,408]
["Rüfenach",656753,260408,659810,262863,657700,262300,381,337,522,407,384]
["Scherz",655274,253910,657706,256530,656300,255400,404,378,527,430,421]
["Schinznach-Bad",654568,254790,655706,257444,655100,255800,366,340,479,362,353]
["Schinznach-Dorf",649900,254712,654790,257800,653100,255300,373,344,752,470,437]
["Thalheim (AG)",647203,252709,651176,256693,650000,254200,444,414,796,594,596]
["Umiken",655687,258537,657228,259775,656600,259300,352,329,428,367,360]
["Unterbözberg",651727,258374,656064,261381,654100,259400,510,425,607,536,539]
["Veltheim (AG)",651737,252062,654824,254961,653500,254300,371,344,670,413,395]
["Villigen",654799,262123,659966,266543,658500,264200,363,327,694,471,459]
["Villnachern",652483,256837,656926,259202,654400,258000,366,329,570,406,384]
["Windisch",657411,256865,660420,260490,658400,259000,359,329,457,364,361]
["Beinwil am See",657000,233232,659137,237055,657800,235300,524,449,644,531,534]
["Birrwil",655975,236775,657989,239571,657300,238000,556,449,766,604,602]
["Burg (AG)",655497,230884,656589,232473,656200,231800,616,560,666,625,626]
["Dürrenäsch",652260,238976,655626,242730,654300,241400,555,496,762,606,593]
["Gontenschwil",651442,232721,655145,237744,653400,235800,535,495,749,589,585]
["Holziken",644123,239861,645812,242380,645200,241400,442,435,547,466,446]
["Leimbach (AG)",654410,235535,656268,236912,655300,236000,528,507,757,589,551]
["Leutwil",654331,238434,656897,241207,655600,240000,612,522,772,649,643]
["Menziken",654312,230365,658237,233508,656700,232700,545,536,869,624,607]
["Oberkulm",649455,236742,654076,240636,651500,238900,475,465,735,547,540]
["Reinach (AG)",653287,232998,658144,237437,656300,233900,527,511,786,593,566]
["Schlossrued",647114,235667,651150,239507,649100,238000,497,475,678,565,566]
["Schmiedrued",649035,232505,652407,237060,650600,234900,593,528,803,660,662]
["Schöftland",644792,238249,648917,241063,646300,239500,460,444,643,503,487]
["Teufenthal (AG)",650740,241105,653628,242939,651300,242200,448,440,628,521,522]
["Unterkulm",648657,239252,652436,243288,651200,240100,467,435,650,538,538]
["Zetzwil",652940,236330,656352,239256,653800,237400,508,495,770,605,604]
["Eiken",639970,263695,642892,267256,641500,264700,332,298,487,346,323]
["Etzgen",649553,267865,652263,270580,650600,269100,336,297,505,371,350]
["Frick",640648,259871,645784,264246,643900,262000,345,339,645,421,412]
["Gansingen",650512,263783,654235,267375,652400,266000,388,368,687,499,490]
["Gipf-Oberfrick",638493,257877,644320,262193,642500,260900,370,354,746,483,467]
["Herznach",643452,256966,648215,259149,646300,258100,421,406,597,489,487]
["Hornussen",645108,259164,649520,263480,647000,261200,383,359,643,479,464]
["Ittenthal",645164,262081,648616,264352,646700,263200,400,370,715,512,500]
["Kaisten",642836,263280,648368,267350,645600,265600,333,288,711,386,380]
["Laufenburg",645722,266585,647941,268405,646800,267900,319,289,502,362,326]
["Mettau",650142,267774,653402,270184,651800,268400,346,327,552,445,464]
["Münchwilen (AG)",638624,264174,640243,266748,639400,265400,338,300,497,379,358]
["Oberhof",640982,253219,644894,256269,642800,255500,474,460,862,639,639]
["Oberhofen (AG)",649808,266636,653367,268372,652300,267300,362,350,560,439,434]
["Oeschgen",642140,262693,645031,265216,643500,263300,335,320,496,388,389]
["Schwaderloch",651719,269668,654218,271947,653100,270800,320,306,501,357,323]
["Sisseln",639499,266320,642862,267519,641400,267100,300,289,306,299,301]
["Sulz (AG)",647538,263175,651463,268102,649500,265100,376,297,670,457,458]
["Ueken",644010,258369,647663,261059,646000,259500,398,367,557,470,479]
["Wil (AG)",652489,266417,655678,270716,653700,268000,378,362,579,475,487]
["Wittnau",637806,256129,642031,260498,640400,258900,408,382,714,533,521]
["Wölflinswil",640230,255191,644606,259178,642200,256900,438,398,836,536,532]
["Zeihen",647465,256429,651232,260037,648700,258500,453,418,751,531,521]
["Ammerswil",656733,245515,659220,247673,658100,246800,455,428,607,497,494]
["Boniswil",655395,238835,657598,241558,656500,240800,475,447,572,487,475]
["Brunegg",658020,251612,660198,253492,658700,252300,426,407,572,437,422]
["Dintikon",658025,244146,660255,247705,659600,246200,442,420,676,527,516]
["Egliswil",655225,243293,658551,246324,656600,244600,469,415,659,512,508]
["Fahrwangen",659719,236025,662054,239904,660800,238500,544,450,654,562,560]
["Hallwil",654865,240817,656708,243100,655700,242300,472,443,540,477,472]
["Hendschiken",657466,247380,659881,249497,658800,248700,412,399,523,430,417]
["Holderbank (AG)",654571,252497,656317,254891,655100,253100,357,347,610,409,385]
["Hunzenschwil",650399,247058,652755,249358,651800,248700,400,394,516,411,405]
["Lenzburg",653314,246012,657808,251145,655500,249000,405,384,552,433,424]
["Meisterschwanden",658639,236613,660457,240722,659700,238500,500,449,554,500,501]
["Möriken-Wildegg",654037,250600,658394,253223,656100,251900,385,347,633,423,405]
["Niederlenz",653811,249667,656769,251686,655700,250300,379,358,429,389,389]
["Othmarsingen",657305,249217,660081,251832,658700,250300,396,388,541,427,421]
["Rupperswil",650213,249112,654157,251852,652000,250500,373,350,401,372,374]
["Schafisheim",651523,245240,654158,249680,653200,247600,416,390,581,451,429]
["Seengen",655816,240480,660173,244161,658000,241800,468,443,711,538,532]
["Seon",652634,242357,656210,246587,654500,244300,443,416,611,476,455]
["Staufen",653255,246285,655555,249871,654900,248200,422,393,513,424,425]
["Abtwil",668162,223272,670427,226481,669500,225200,537,501,661,548,539]
["Aristau",667786,236274,672093,240061,670000,237700,394,379,471,411,393]
["Auw",667312,228026,671830,231930,670200,229300,488,458,782,529,495]
["Beinwil (Freiamt)",666280,228995,670832,233200,668700,231500,576,458,852,652,633]
["Benzenschwil",669054,232236,671174,234283,670100,233400,457,404,545,473,472]
["Besenbüren",667745,239488,669262,241644,668500,240600,454,428,492,454,455]
["Bettwil",661725,236034,665102,239115,662700,238100,694,639,753,703,703]
["Boswil",663918,236327,668238,242311,666100,239200,456,429,700,517,491]
["Bünzen",665149,239749,668195,243108,666900,240300,441,427,476,444,440]
["Buttwil",664772,233706,667151,236938,666000,235700,638,579,811,684,671]
["Dietwil",670942,221172,674052,223854,672300,222300,440,403,536,440,419]
["Geltwil",665690,232460,669073,234623,667000,233500,683,531,824,662,657]
["Kallern",663474,238339,665235,241853,664700,241000,532,449,675,572,581]
["Merenschwand",669535,232844,673612,237726,670800,234800,396,383,475,394,386]
["Mühlau",670719,230137,673401,233504,672000,231400,396,388,475,412,400]
["Muri (AG)",666220,233287,669970,238804,668400,236000,461,433,624,495,476]
["Oberrüti",671230,222909,674065,226327,672500,224300,420,399,495,420,411]
["Rottenschwil",668912,239358,671291,242453,669900,240800,383,378,451,391,380]
["Sins",667545,221762,673257,230340,672400,227200,419,394,752,498,492]
["Waltenschwil",663192,241594,666687,244267,665400,243000,425,424,522,442,432]
["Hellikon",634315,260261,638052,263777,636600,262200,417,398,634,525,533]
["Kaiseraugst",620701,263852,624466,266085,621500,265600,267,261,381,308,295]
["Magden",625941,260731,629874,265526,628200,264100,329,308,606,413,404]
["Möhlin",628565,264737,634555,270995,630600,267500,311,281,630,331,326]
["Mumpf",634357,264990,637768,267247,636300,266200,291,284,489,351,341]
["Obermumpf",635988,262621,639007,265940,637600,264400,375,320,555,460,468]
["Olsberg",623455,260320,627215,265660,626000,263500,387,327,560,414,408]
["Rheinfelden",623652,264724,630065,270872,626900,267000,282,261,417,306,297]
["Schupfart",637933,260189,641081,264391,639700,262700,448,410,738,514,500]
["Stein (AG)",637379,264697,639599,267608,638400,266000,296,283,485,328,300]
["Wallbach",633067,266952,635580,270457,635000,267700,287,281,351,314,314]
["Wegenstetten",635128,259073,638763,262426,637300,260900,441,428,717,536,522]
["Zeiningen",631146,263262,634739,268888,632500,265700,341,313,596,410,382]
["Zuzgen",632874,261642,636950,265860,634800,263800,376,367,636,502,517]
["Aarburg",634259,239718,636932,243560,634900,241100,399,388,592,432,410]
["Attelwil",644190,233998,646667,235683,645700,234500,500,473,677,551,538]
["Bottenwil",640859,235588,643998,238581,642900,237300,490,470,660,560,554]
["Brittnau",634282,231780,639602,236282,638500,234300,452,434,611,493,496]
["Kirchleerau",646605,234994,649382,237827,647600,236300,512,489,706,592,600]
["Kölliken",642432,240109,645907,244521,644100,242900,441,420,562,457,450]
["Moosleerau",646250,233926,649169,236395,647300,235500,510,473,706,541,522]
["Murgenthal",629249,231370,634567,237755,630200,235300,411,397,565,481,481]
["Oftringen",635518,238099,640670,242827,636500,240700,420,409,680,469,450]
["Reitnau",643531,232355,647282,234897,645900,233400,514,474,682,581,596]
["Rothrist",631235,236692,637046,240638,633300,239500,406,399,500,433,424]
["Safenwil",639659,239760,643238,242839,641200,241300,473,429,638,510,492]
["Staffelbach",643557,235244,647482,238756,645900,237100,469,459,677,534,518]
["Strengelbach",635365,234960,638001,238736,637100,236500,436,415,522,454,449]
["Uerkheim",641174,237888,645154,240756,644300,239700,459,448,651,543,544]
["Vordemwald",632400,232635,636375,238425,634800,236000,430,413,541,467,466]
["Wiliberg",642842,234668,644656,235741,644200,235400,661,519,681,615,625]
["Zofingen",637090,236092,642485,239823,638300,237700,436,423,660,519,513]
["Baldingen",664745,266533,666919,268460,666000,267500,540,399,581,523,522]
["Böbikon",666544,266239,668983,268106,667300,267400,444,419,581,518,523]
["Böttstein",657658,265952,661357,270410,660900,269100,320,318,568,361,330]
["Döttingen",659211,266144,663118,270037,661700,269100,347,317,514,365,352]
["Endingen",662309,262566,666513,266535,664100,265500,385,383,591,475,468]
["Fisibach",671731,265182,673757,270055,672900,268400,376,328,601,434,428]
["Full-Reuenthal",656096,271573,658864,274775,657500,273800,316,309,426,343,316]
["Kaiserstuhl",673391,268727,674279,269337,673700,269100,354,337,368,356,360]
["Klingnau",658847,269630,663047,272739,661400,270100,321,314,532,396,387]
["Koblenz",658837,271940,662068,274181,659700,273200,317,314,437,351,351]
["Leibstadt",653959,269222,657154,272941,655400,271200,342,308,529,380,351]
["Lengnau (AG)",664055,262098,668981,266668,667100,263700,415,398,607,502,493]
["Leuggern",655434,267754,660375,274185,658600,270200,341,314,538,387,379]
["Mellikon",667416,267313,669469,269297,668800,268900,352,327,557,433,435]
["Rekingen (AG)",665222,267738,667626,270165,666500,269200,341,326,554,417,404]
["Rietheim",661178,270966,664137,273976,663100,272500,338,317,502,363,336]
["Rümikon",669225,267714,672261,269791,670700,268700,348,327,514,401,404]
["Schneisingen",667855,262521,671477,266578,669700,263500,481,439,608,531,530]
["Siglistorf",669564,264261,672601,267652,670900,266500,444,436,602,527,524]
["Tegerfelden",662030,266340,665534,269882,663800,268000,359,338,532,425,411]
["Unterendingen",662059,265542,666492,267403,664100,266700,383,367,582,449,418]
["Wislikofen",668202,266130,671758,268547,669400,267900,392,376,582,484,483]
["Bad Zurzach",662740,269113,666059,273623,664500,271000,340,319,520,388,361]
["Hallwilersee (AG)",657443,233776,659776,241217,null,null,null,449,449,449,449]

{"sheet":"Karte","index":4,"n_rows":17,"n_cols":15,"rows_kept":17,"cut":false,"hidden":false,"merged":[]}
[null,null,null,null,null,null,null,null,null,null,null,"Bild",null,"in cm"]
[null,null,null,null,null,null,null,null,null,null,null,"Höhe",null,14.89]
[null,null,null,null,null,null,null,null,null,null,null,"Breite",null,15.56]
[]
[]
[null,null,null,null,null,null,null,null,null,null,null,"Koordinaten des Kantons",null,"in cm"]
[null,null,null,null,null,null,null,null,null,null,null,"(Kartesisches Koordinaten System)"]
[null,null,null,null,null,null,null,null,null,null,null,"XMIN",{"$f":"MIN(tblGeoDaten[XMIN])","v":620701},0," Minimale x-Koordinate des Gebiets [m]  "]
[null,null,null,null,null,null,null,null,null,null,null,"XMAX",{"$f":"MAX(tblGeoDaten[XMAX])","v":676827},{"$f":"N3","v":15.56}," Maximale x-Koordinate des Gebiets [m]  "]
[null,null,null,null,null,null,null,null,null,null,null,"YMIN",{"$f":"MIN(tblGeoDaten[YMIN])","v":221172},0," Minimale y-Koordinate des Gebiets [m]  "]
[null,null,null,null,null,null,null,null,null,null,null,"YMAX",{"$f":"MAX(tblGeoDaten[YMAX])","v":274775},{"$f":"N2","v":14.89}," Maximale y-Koordinate des Gebiets [m]  "]
[]
[null,null,null,null,null,null,null,null,null,null,null,"Koordinaten der Gemeinde"]
[null,null,null,null,null,null,null,null,null,null,null,"(Microsoft Excel Koordinaten System)"]
[null,null,null,null,null,null,null,null,null,null,null,{"$f":"auswahlGemeinde","v":"Holziken"}]
[null,null,null,null,null,null,null,null,null,null,null,"X-Achse für Excel",{"$f":"VLOOKUP(auswahlGemeinde,tblGeoDaten[],COLUMN(tblGeoDaten[[#Headers],[ZKX]]),0)","v":645200},{"$f":"((M16-M8)/(M9-M8)*N9)","v":6.7919402772333681}]
[null,null,null,null,null,null,null,null,null,null,null,"Y-Achse für Excel",{"$f":"VLOOKUP(auswahlGemeinde,tblGeoDaten[],COLUMN(tblGeoDaten[[#Headers],[ZKY]]),0)","v":241400},{"$f":"((M17-M10)/(M11-M10))*N11","v":5.6189937130384493}]